{"text_format":"3","workbook":"xlsx","n_sheets":5,"sheets":["Inschrijfformulier","Vraagprogramma","Handleiding","Verenigingen","Inschijfgeld ed"],"not_rendered":{"images":3,"macros":1,"external_links":1,"defined_names":12,"comments":2},"read":"whole","date_system":"1900"}

{"sheet":"Inschrijfformulier","index":0,"n_rows":83,"n_cols":46,"rows_kept":83,"merged":[[0,0,3,0],[0,1,0,12],[1,1,1,12],[2,1,2,12],[4,1,4,12],[4,33,4,35],[5,1,5,12],[5,33,5,35],[6,1,6,12],[7,2,7,3],[7,4,7,12],[7,33,7,34],[8,2,8,3],[8,4,8,6],[8,8,8,9],[8,33,8,34],[9,2,9,3],[9,4,9,6],[9,8,9,9],[9,19,9,23],[9,33,9,34],[10,2,10,3],[10,4,10,6],[10,8,10,9],[10,19,10,23],[10,33,10,34],[11,2,11,3],[11,4,11,6],[11,8,11,9],[11,33,11,34],[12,2,12,3],[12,4,12,6],[12,8,12,9],[12,33,12,34],[13,2,13,3],[13,4,13,9],[13,33,13,34],[14,2,14,3],[14,4,14,6],[14,8,14,9],[14,33,14,34],[15,2,15,3],[15,4,15,6],[15,7,15,10],[15,33,15,34],[16,2,16,3],[16,4,16,10],[16,33,16,34],[17,4,17,6],[17,7,17,10],[17,22,17,24],[17,33,17,34],[18,33,18,34],[19,4,19,10],[19,33,19,34],[20,2,20,3],[20,4,20,12],[20,33,20,34],[21,2,21,3],[21,33,21,34],[21,41,21,44],[22,2,22,3],[23,2,23,3],[23,33,23,34],[23,37,23,38],[23,39,23,40],[24,2,24,3],[25,2,25,3],[26,2,26,3],[27,2,27,3],[28,2,28,3],[28,37,28,38],[28,39,28,40],[29,2,29,3],[30,2,30,3],[31,2,31,3],[32,2,32,3],[32,33,32,34],[32,37,32,38],[33,2,33,3],[34,2,34,3],[35,2,35,3],[36,2,36,3],[37,2,37,3],[38,2,38,3],[39,2,39,3],[39,33,39,34],[40,2,40,3],[41,2,41,3],[42,2,42,3],[43,2,43,3],[43,33,43,34],[44,2,44,3],[45,2,45,3],[46,2,46,3],[47,2,47,3],[48,2,48,3],[49,2,49,3],[50,2,50,3],[50,33,50,34],[51,2,51,3],[52,2,52,3],[53,2,53,3],[54,2,54,3],[55,2,55,3],[56,2,56,3],[57,2,57,3],[58,2,58,3],[59,2,59,3],[60,2,60,3],[61,2,61,3],[62,2,62,3],[63,2,63,3],[64,2,64,3],[65,2,65,3],[66,2,66,3],[68,6,68,10],[70,1,70,12],[72,1,72,12],[74,1,75,12],[76,1,76,12],[78,2,78,3],[78,4,78,5],[78,6,78,10],[79,1,79,12],[80,1,80,12],[81,1,81,12],[82,1,82,12]]}
["CONTROLE KOLOM",{"$f":"'Inschijfgeld ed'!B31","v":"v.v. 't Sieske"}]
[null,{"$f":"'Inschijfgeld ed'!B32","v":"Stein"}]
[null,{"$f":"'Inschijfgeld ed'!B33","v":"AANGESLOTEN BIJ DE NEDERLANDSE BOND VAN VOGELLIEFHEBBERS"}]
[]
[">>>","INSCHRIJFFORMULIER",{"$nulls":31},"VERGEET ONDERSTAANDE NIET IN TE VULLEN"]
[">>>",{"$f":"'Inschijfgeld ed'!B35","v":"Tentoonstelling 2025"},{"$nulls":31},"(als u een van de onderstaande correct ingevuld heeft is het vak groen)"]
["▼▼","Uitleg over wat u in de gele vakken in moet vullen? Ga met uw muis op het vakje staan met het rode hoekje.",{"$nulls":12},{"$f":"O8+O18","v":0},null,null,"Ja",{"$nulls":15},"Correct ingevuld","Nog niet en/of niet correct ingevuld","Regel"]
[">>>","Kweeknummer:",null,null,"TOTAAL INSCHRIJFGELD",{"$nulls":9},{"$f":"LEN(C8)","v":0},{"$f":"IF(O8=4,0,IF(C8=\"\",0,LEN(C8)))","v":0},null,"Nee",{"$nulls":8}," ",{"$nulls":6},"Kweeknummer nog invullen (verplicht) ",null,"C8"]
[">>>","Ander C.O.M. nummer:",null,null,"Enkelingen:",null,null,{"$f":"G68","v":0},"x",null,{"$f":"IF(C20=\"Ja\",'Inschijfgeld ed'!B9,'Inschijfgeld ed'!B8)","v":{"v":2,"d":"€ 2.00"}},"=",{"$f":"H9*K9","v":0},null,{"$f":"LEN(C9)","v":0},{"$f":"IF(O9<10,0,IF(C9=\"\",0,LEN(C9)))","v":0},{"$nulls":17},"Ander C.O.M. nummer invullen (niet verplicht) ",null,"C9"]
[">>>","Achternaam:",null,null,"Stellen:",null,null,{"$f":"H68","v":0},"x",null,{"$f":"IF(Y10=\"Nee\",0,IF(C20=\"Ja\",'Inschijfgeld ed'!B17,'Inschijfgeld ed'!B16))","v":{"v":4,"d":"€ 4.00"}},"=",{"$f":"H10*K10","v":0},null,{"$f":"LEN(C10)","v":0},{"$f":"IF(O10<45,0,IF(C10=\"\",0,LEN(C10)))","v":0},{"$nulls":3},"Naam Inzender",{"$nulls":4},{"$f":"'Inschijfgeld ed'!B63","v":"Ja"},{"$nulls":8},"Uw achternaam nog invullen (verplicht) ",null,"C10"]
[">>>","Tussenvoegsel:",null,null,"Stammen:",null,null,{"$f":"I68","v":0},"x",null,{"$f":"IF(Y11=\"Nee\",0,IF(C20=\"Ja\",'Inschijfgeld ed'!B13,'Inschijfgeld ed'!B12))","v":{"v":8,"d":"€ 8.00"}},"=",{"$f":"H11*K11","v":0},null,{"$f":"LEN(C11)","v":0},{"$f":"IF(O11<45,0,IF(C11=\"\",0,LEN(C11)))","v":0},{"$nulls":3},{"$f":"IF(C11=\"\", C10 & \" \" & C12,C10 & \" \" & C11 & \" \" & C12)","v":" "},{"$nulls":4},{"$f":"'Inschijfgeld ed'!B65","v":"Ja"},{"$nulls":8},"Eventueel uw tussenvoegsels nog invullen (indien van toepassing verplicht)",null,"C11"]
[">>>","Voorletters:",null,null,"Open Klasse (O.E.K.):",null,null,{"$f":"J68","v":0},"x",null,{"$f":"IF(Y12=\"Nee\",0,IF(C20=\"Ja\",'Inschijfgeld ed'!B9,'Inschijfgeld ed'!B8))","v":{"v":2,"d":"€ 2.00"}},"=",{"$f":"H12*K12","v":0},null,{"$f":"LEN(C12)","v":0},{"$f":"IF(O12<45,0,IF(C12=\"\",0,LEN(C12)))","v":0},{"$nulls":8},{"$f":"'Inschijfgeld ed'!B67","v":"Ja"},{"$nulls":8},"Uw voorletters nog invullen",null,"C12"]
[">>>","Adres:",null,null,"Open Klasse (O.K.):",null,null,{"$f":"K68","v":0},"x",null,{"$f":"IF(Y13=\"Nee\",0,IF(C20=\"Ja\",'Inschijfgeld ed'!B9,'Inschijfgeld ed'!B8))","v":{"v":0,"d":"€ 0.00"}},"=",{"$f":"H13*K13","v":0},null,{"$f":"LEN(C13)","v":0},{"$f":"IF(O13<30,0,IF(C13=\"\",0,LEN(C13)))","v":0},null,{"$f":"SUM(M9:M13)","v":0},"<< totaal M9 t/m M13",{"$nulls":5},{"$f":"'Inschijfgeld ed'!B69","v":"Nee"},{"$nulls":8},"Uw adres nog invullen (verplicht) ",null,"C13"]
[">>>","Postcode:",null,null,"Admi-, portokosten en verplichte catalogus:",{"$nulls":7},{"$f":"IF(C20=\"Ja\",'Inschijfgeld ed'!B21,'Inschijfgeld ed'!B20)","v":{"v":3.5,"d":"€ 3.50"}},null,0,{"$f":"IF(O14=7,0,IF(C14=\"\",0,LEN(C14)))","v":0},{"$nulls":17},"Uw postcode nog invullen (verplicht)",null,"C12"]
[">>>","Woonplaats:",null,null,{"$f":"Z15","v":"Huurkooien n.v.t."},null,null,{"$f":"M68","v":0},"x",null,{"$f":"IF(AL35=\"Nee\",0,IF(C20=\"Ja\",'Inschijfgeld ed'!B26,'Inschijfgeld ed'!B25))","v":{"v":0,"d":"€ 0.00"}},"=",{"$f":"H15*K15","v":0},null,0,{"$f":"IF(O15<30,0,IF(C15=\"\",0,LEN(C15)))","v":0},null,{"$f":"M14+M15","v":{"v":3.5,"d":"€ 3.50"}},"<< totaal M14 + M15",{"$nulls":5},{"$f":"IF(AL35=\"Nee\",1,0)","v":1},{"$f":"IF(Y15=1,\"Huurkooien n.v.t.\", \"Evt. Huurkooien\")","v":"Huurkooien n.v.t."},{"$nulls":7},"Uw woonplaats nog invullen (verplicht) ",null,"C13"]
[">>>","Telefoonnummer: ",null,null,"Extra bijdrage ",{"$nulls":6},"=",null,null,0,{"$f":"IF(O16<20,0,IF(C16=\"\",0,LEN(C16)))","v":0},{"$nulls":17},"Uw telefoonummer nog invullen (bijv. 000-0000000) (niet verplicht) ",null,"C14"]
[">>>","Mobielnummer: ",null,null,"U komt met het hier achterstaande aantal eigen kooien:",{"$nulls":6},{"$f":"G69-M68","v":0},"=====+",null,0,{"$f":"IF(O17<20,0,IF(C17=\"\",0,LEN(C17)))","v":0},null,"Max.In.",{"$nulls":15},"Uw mobielnummer nog invullen (bijv. 06-00000000) (niet verplicht) ",null,"C15"]
[">>>","Lid afdeling: (code)",null,{"$f":"IF(C18=\"\",\"\",IFERROR(VLOOKUP(C18,Verenigingen!A4:C452,3,FALSE),\"Onbekend\"))","v":""},{"$f":"IF(U18=0,W18,V18)","v":"  "},null,null,"Bekers",{"$nulls":3},"Te betalen:",{"$f":"S18","v":{"v":3.5,"d":"€ 3.50"}},null,0,{"$f":"IF(O18=3,0,IF(C18=\"\",0,LEN(C18)))","v":0},{"$f":"IF(D18=\"Onbekend\",1,0)","v":0},{"$f":"'Inschijfgeld ed'!B29","v":{"v":999.99,"d":"€ 999.99"}},{"$f":"IF(R13<R18,R13+R15+M16,R18+R15+M16)","v":{"v":3.5,"d":"€ 3.50"}},null,{"$f":"IF('Inschijfgeld ed'!B49= \"Uit\",1,0)","v":1},"  ","Uw prijskeuze is:",{"$nulls":10},"De code van uw verenigingen nog invullen (verplicht) ",null,"C16"]
[">>>","Lid Speciaalclub: (naam)","nvt",{"$f":"IF(C19=\"\",\"\",IFERROR(VLOOKUP(C19,Verenigingen!F4:G432,2,FALSE),\"Onbekend\"))","v":"N.V.T. Wordt niet gevraagd op deze TT"},{"$f":"S19& \" \" & X19","v":"Het max. inschrijfgeld bedraagt (excl. Admi-, portokosten en catalogus):"},{"$nulls":7},{"$f":"R18","v":{"v":999.99,"d":"€ 999.99"}},null,3,{"$f":"IF(O19=3,0,IF(C19=\"\",0,LEN(C19)))","v":0},null,{"$f":"IF(R18<999.99,1,0)","v":0},"Het max. inschrijfgeld bedraagt",{"$nulls":4},"(excl. Admi-, portokosten en catalogus):",{"$nulls":9},"De naam van de speciaalclub nog invullen via Dropdownbox (niet verplicht) ",null,"D17"]
[">>>","Jeugdinzender: (Ja/Nee)",null,"Jeugdinzender","Mogen er foto's van uw vogels gemaakt worden:",{"$nulls":6},"Nee",null,null,{"$f":"IF(C20=\"Ja\",1,IF(C20=\"Nee\",2,IF(C20=\"\",3)))","v":3},{"$f":"IF(C20= \"Ja\",1,0)","v":0},{"$nulls":3},{"$f":"L20","v":"Nee"},{"$nulls":13},"Jeugdinzender Ja/Nee nog aangeven (verplicht via Dropdownbox) ",null,"C18"]
{"$rows_left_out":64}
{"sheet":"Vraagprogramma","index":1,"n_rows":6579,"n_cols":8,"rows_kept":6579,"merged":[[0,0,0,4],[0,6,0,7]]}
["VRAAGPROGRAMMA 2025-2029 (VERSIE: SEPTEMBER 2025)",{"$nulls":5},"UITLEG, HOE GEBRUIKT U DE ZOEKFUNCTIE"]
["Klasse","Soort",null,"Kooi","Aantal jaar",null,"Om in deze lijst te kunnen zoeken naar een klasse-nummer kunt u de zoekfunctie gebruiken."]
[1001001,"ZangKan.Harzer kloekvrij",null,"01",1,null,"Deze zoekfunctie activeert u door de CTRL-knop op uw toetsenbord ingedrukt te houden"]
[1001002,"ZangKan.Harzer met kloeken",null,"01",1,null,"en dan vervolgens op de letter F te klikken. Dan verschijnt het hieronder staand scherm."]
[1002001,"ZangKan.Waterslagers",null,"01",1]
[1003001,"ZangKan.Timbrado original",null,"01",2]
[1003002,"ZangKan.Timbrado floreado",null,"01",2]
[2001001,"Kl.Kan.Lipochroom wit dominant",null,"02",2]
[2002001,"Kl.Kan.Lipochroom wit",null,"02",2]
[2003001,"Kl.Kan.Lipochroom albino dominant",null,"02",2]
[2004001,"Kl.Kan.Lipochroom albino",null,"02",2]
[2005001,"Kl.Kan.Lipochroom geel intensief",null,"02",2,null,"Vervolgens kunt u in het vakje achter \"Zoeken naar\" de naam, of een gedeelte daarvan, van de"]
[2005002,"Kl.Kan.Lipochroom geelivoor intensief",null,"02",2,null,"gewenste vogel intikken. Vervolgens klikt u met uw muis op de knop \"Volgende zoeken\"."]
[2006001,"Kl.Kan.Lipochroom geel intensief witte pennen",null,"02",2,null,"Als u dan uw vogel gevonden heeft staat voor de naam het klasse-nummer en dit nummer gebruikt"]
[2006002,"Kl.Kan.Lipochroom geelivoor intensief witte pennen",null,"02",2,null,"u vervolgens in het tabblad \"Inschrijfformulier\". En als u dit klasse-nummer heeft ingetikt (niet kopieren/plakken)"]
[2007001,"Kl.Kan.Lipochroom lutino intensief",null,"02",2,null,"verschijnt de naam van uw vogel in het vakje er naast."]
[2007002,"Kl.Kan.Lipochroom lutino-ivoor intensief",null,"02",2,null,"Heeft u nog niet de juiste vogel gevonden dan klikt u met uw muis weer op de knop \"Volgende zoeken\""]
[2008001,"Kl.Kan.Lutino intensief witte pennen",null,"02",2,null,"Dit doet u net zolang tot dat u uw gewenste vogel gevonden heeft."]
[2008002,"Kl.Kan.Lutino-ivoor intensief witte pennen",null,"02",2,null,"Als u klaar bent met zoeken kunt u, in het zoekscherm op de knop \"Sluiten\" klikken met uw muis."]
[2009001,"Kl.Kan.Lipochroom geel schimmel",null,"02",2]
{"$rows_left_out":6560}
{"sheet":"Handleiding","index":2,"n_rows":93,"n_cols":8,"rows_kept":93,"merged":[[0,0,0,10],[1,0,1,10],[6,0,6,8],[7,0,7,8],[8,0,8,8],[9,2,9,8],[11,2,11,8],[14,2,14,8],[15,2,15,8],[16,2,16,8],[17,2,17,8],[18,2,18,8],[19,2,19,8],[22,2,22,10],[23,2,23,8],[25,2,25,8],[28,0,28,8],[29,0,29,10],[30,0,30,10],[34,0,34,10],[37,0,37,8],[38,0,38,8],[39,0,39,10],[40,0,40,10],[41,0,41,8],[42,0,42,8],[43,0,43,8],[46,0,46,8],[47,2,47,10],[48,2,48,8],[50,2,50,10],[51,2,51,10],[53,2,53,10],[54,2,54,8],[55,2,55,10],[56,2,56,10],[57,2,57,8],[58,2,58,8],[59,2,59,8],[61,2,61,8],[62,2,62,8],[64,2,64,8],[65,2,65,8],[67,2,67,8],[68,2,68,8],[70,2,70,8],[71,2,71,10],[72,2,72,8],[73,2,73,10],[74,2,74,8],[77,0,77,10]]}
["Handleiding invullen voor het Digitale Inschrijfformulier"]
["Wat moet u allemaal invullen om een zo'n compleet mogelijk inschrijfformulier in te leveren"]
[]
["Het Digitale inschrijfformulier is gemaakt om het voor u en uw TT-Secretaris zo gemakkelijk mogelijk te maken."]
["Er zijn diverse controles ingebouwd zodat u niets kunt vergeten om dit formulier goed in te kunnen vullen, succes."]
["LET OP! een APOSTROF ( ' ) mag in de tekstvakken niet gebruikt worden en een spatie is ook een karakter."]
[]
["NAW-gegevens"]
["Hieronder vul jij de diverse gevraagde gegevens in"]
["Kweeknummer:",":","Vul hier uw kweeknummer in (verplicht - 4 karakters)"]
["Ander C.O.M. nummer:",":","Vul hier een ander kweeknummer dan uw NBvV-kweeknummer in (niet verplicht - max.10 karakters)"]
["Achternaam:",":","Vul hier uw achternaam in (verplicht - max.28 karakters)"]
["Tussenvoegsel:",null,"Indien van toepassing vul hier uw tussenvoegsel in (indien van toepassing verplicht - max.8 karakters)"]
["Voorletters:",null,"Vul hier uw voorletters in (verplicht - max 7 karakters)"]
["Adres:",":","Vul hier uw adres in (verplicht - max.30 karakters)"]
["Postcode:",":","Vul hier uw postcode in (verplicht - max.7 karakters)"]
["Woonplaats:",":","Vul hier uw woonplaats in (verplicht - max.30 karakters)"]
["Telefoonnummer: ",":","Vul hier uw telefoonnummer in (verplicht - max.20 karakters)"]
["Mobielnummer: ",":","Vul hier uw mobielnummer in (verplicht - max.20 karakters)"]
["Lid afdeling: (code)",":","Vul hier de code van de vereniging in waar u lid van bent (verplicht - 3 karakters)"]
{"$rows_left_out":74}
{"sheet":"Verenigingen","index":3,"n_rows":457,"n_cols":20,"rows_kept":457,"merged":[[0,0,0,2],[0,4,0,6],[0,10,0,12],[38,5,38,12],[39,5,39,12],[40,5,40,12],[41,5,41,12],[42,5,42,12],[43,5,43,12],[44,5,44,12],[45,5,45,12],[46,5,46,12],[47,5,47,12],[49,5,49,12]]}
["Verenigingen",{"$nulls":3},"Speciaalclubs voor in het Dropdown menu",{"$nulls":5},"Speciaalclubs invoeren"]
["Ver.Code (3)","Prov.","Verenigingsnaam/plaats ",null,"R","Ver.Code (3)","Verenigingsnaam/plaats ",{"$nulls":3},"R","Ver.Code (3)","Verenigingsnaam/plaats ",{"$nulls":6},"Kampen 2"]
[{"$nulls":7},{"$f":"IF(F3=\"\",\"\",F3)","v":""},{"$nulls":11},"Oostermoer/Gorecht"]
[113,"GR","v.v. Oostermoer/Gorecht - Oostermoer/Gorecht",null,1,"NVT",{"$f":"IFERROR(VLOOKUP(F4,L$3:M$32,2,FALSE),\"\")","v":"N.V.T. Wordt niet gevraagd op deze TT"},{"$f":"IF(F4=\"\",\"\",UPPER(F4))","v":"NVT"},{"$f":"LEN(F4)","v":3},null,1,"NVT","N.V.T. Wordt niet gevraagd op deze TT",{"$f":"IF(L4=\"\",\"\",LEN(L4))","v":3},{"$nulls":5},"Schiphol"]
["218","UT","v.v. Kanaria I - Utrecht 1",null,2,"SEC","Spec.club Europese Cultuurvogels (SEC)",{"$f":"IF(F5=\"\",\"\",UPPER(F5))","v":"SEC"},{"$f":"LEN(F5)","v":3},null,2,"SAP","Spec.club Afrikaanse Prachtvinken (AP)",{"$f":"IF(L5=\"\",\"\",LEN(L5))","v":3},{"$nulls":5},"Utrecht 1"]
["219","UT","E.U.K.V. - Utrecht 2",null,3,null,"","",0,null,3,"IVV","Spec.club van Insecten- en Vruchtenetende Vogels (IVV)",3,{"$nulls":5},"Utrecht 2"]
["305","OV","De Hobbyfluiters - Delden",null,4,null,"","",0,null,4,"JMC","Spec.club Jap.meeuwen en overige lonchura's (JMC)",3,{"$nulls":5},"Delden"]
["308","GL","De Edelzanger   - Bennekom",null,5,null,"","",0,null,5,"SNG","Spec.club Natuurbroed Gouldamadine Ned.(SNGN)",3,{"$nulls":5},"Bennekom"]
["311","GL","v.v. Ons Genoegen - Didam 2",null,6,null,"","",0,null,6,"NKC","Ned.Kleurkanarie Club (NKC)",3,{"$nulls":5},"Didam 2"]
["319","OV","v.v. Ons Genoegen - Haaksbergen 2",null,7,null,"","",0,null,7,"MOZ","Ned.Speciaalclub Mozaiek Kanaries (MOZ)",3,{"$nulls":5},"Ede"]
["320","OV","Kanarie En Vogelver. Hattem - Hattem",null,8,null,"","",0,null,8,"NZC","Ned.Zebravinken Club (NZC)",3,{"$nulls":5},"Haaksbergen 2"]
["324","GL","v.v.De Gevleugelde Zanger\" - Lichtenvoorde",null,9,null,"","",0,null,9,"PSC","Parkieten Spec.club (PSC)",3,{"$nulls":5},"Hattem"]
["332","OV","v.v. Kleur En Zang - Oldenzaal 3",null,10,null,"","",0,null,10,"SCA","SC Austr.Prachtvinken & Papegaai Amadines (SCAP)",3,{"$nulls":5},"Lichtenvoorde"]
["334","GL","v.v. De Vogelvrienden - Doesburg 2",null,11,null,"","",0,null,11,"TIM","Spanish Timbrado Society (TIM)",3,{"$nulls":5},"Losser"]
["336","OV","Eerst Rijssense Kanariever. - Rijssen 3",null,12,null,"","",0,null,12,"SEC","Spec.club Europese Cultuurvogels (SEC)",3,{"$nulls":5},"Oldenzaal 3"]
["341","GL","v.v. De Gevleugelde Vrienden - Velp",null,13,null,"","",0,null,13,"SKN","Spec.club Kleurkanarie N-N (SKNN)",3,{"$nulls":5},"Doesburg 2"]
["342","GL","v.v.De Vogelvrienden   - Vorden",null,14,null,"","",0,null,14,"SCK","Spec.club Kleurkanaries (SCK)",3,{"$nulls":5},"Rijssen 3"]
["343","OV","Evkv Vriezenveen - Vriezenveen 2",null,15,null,"","",0,null,15,"HAR","Spec.club L.S.H. Harzers (HARZERS)",3,{"$nulls":5},"Apeldoorn 4"]
["350","GL","v.v.Vogelvreugd   - Zelhem",null,16,null,"","",0,null,16,"NPV","Spec.club Postuurkanaries NPV (NPV)",3,{"$nulls":5},"Velp"]
["358","OV","v.v. Onder Vrienden Opgericht - Zwolle 4",null,17,null,"","",0,null,17,"SWS","Spec.club Waterslagers \"De Nachtegaal\"  (WS)",3,{"$nulls":5},"Vorden"]
{"$rows_left_out":376}
{"sheet":"Inschijfgeld ed","index":4,"n_rows":72,"n_cols":8,"rows_kept":72,"hidden":true,"merged":[[0,0,0,1],[1,0,1,1],[5,0,5,1],[6,0,6,1],[10,0,10,1],[14,0,14,1],[18,0,18,1],[22,0,22,1],[27,0,27,1],[60,0,60,1]]}
["Alleen de gele gemarkeerde vakken aanpassen"]
["Jeugd"]
["Jeugd - Ja","Ja"]
["Jeugd - Nee","Nee"]
[]
["Inschrijfgeld"]
["Enkelingen (EK) / Overjarig Eigenkweek (OEK) / Open Klasse (OK)"]
["senioren",{"v":2,"d":"€ 2.00"}]
["Jeugd",{"v":2,"d":"€ 2.00"}]
[null,"▲ altijd ingevuld houden, wordt er geen inschrijfgeld gevraagd dan € 0,00 invullen"]
["Stammen"]
["senioren",{"v":8,"d":"€ 8.00"}]
["jeugd",{"v":8,"d":"€ 8.00"}]
[null,"▲ altijd ingevuld houden, wordt er geen inschrijfgeld gevraagd dan € 0,00 invullen"]
["Stellen"]
["senioren",{"v":4,"d":"€ 4.00"}]
["jeugd",{"v":4,"d":"€ 4.00"}]
[null,"▲ altijd ingevuld houden, wordt er geen inschrijfgeld gevraagd dan € 0,00 invullen"]
["catalogus/portokosten"]
["senioren",{"v":3.5,"d":"€ 3.50"}]
{"$rows_left_out":52}