{"text_format":"3","workbook":"xlsx","n_sheets":5,"sheets":["Inschrijfformulier","Vraagprogramma","Handleiding","Verenigingen","Inschijfgeld ed"],"not_rendered":{"images":3,"macros":1,"external_links":1,"defined_names":12,"comments":2},"read":"whole","date_system":"1900"}

{"sheet":"Inschrijfformulier","index":0,"n_rows":83,"n_cols":46,"rows_kept":83,"merged":[[0,0,3,0],[0,1,0,12],[1,1,1,12],[2,1,2,12],[4,1,4,12],[4,33,4,35],[5,1,5,12],[5,33,5,35],[6,1,6,12],[7,2,7,3],[7,4,7,12],[7,33,7,34],[8,2,8,3],[8,4,8,6],[8,8,8,9],[8,33,8,34],[9,2,9,3],[9,4,9,6],[9,8,9,9],[9,19,9,23],[9,33,9,34],[10,2,10,3],[10,4,10,6],[10,8,10,9],[10,19,10,23],[10,33,10,34],[11,2,11,3],[11,4,11,6],[11,8,11,9],[11,33,11,34],[12,2,12,3],[12,4,12,6],[12,8,12,9],[12,33,12,34],[13,2,13,3],[13,4,13,9],[13,33,13,34],[14,2,14,3],[14,4,14,6],[14,8,14,9],[14,33,14,34],[15,2,15,3],[15,4,15,6],[15,7,15,10],[15,33,15,34],[16,2,16,3],[16,4,16,10],[16,33,16,34],[17,4,17,6],[17,7,17,10],[17,22,17,24],[17,33,17,34],[18,33,18,34],[19,4,19,10],[19,33,19,34],[20,2,20,3],[20,4,20,12],[20,33,20,34],[21,2,21,3],[21,33,21,34],[21,41,21,44],[22,2,22,3],[23,2,23,3],[23,33,23,34],[23,37,23,38],[23,39,23,40],[24,2,24,3],[25,2,25,3],[26,2,26,3],[27,2,27,3],[28,2,28,3],[28,37,28,38],[28,39,28,40],[29,2,29,3],[30,2,30,3],[31,2,31,3],[32,2,32,3],[32,33,32,34],[32,37,32,38],[33,2,33,3],[34,2,34,3],[35,2,35,3],[36,2,36,3],[37,2,37,3],[38,2,38,3],[39,2,39,3],[39,33,39,34],[40,2,40,3],[41,2,41,3],[42,2,42,3],[43,2,43,3],[43,33,43,34],[44,2,44,3],[45,2,45,3],[46,2,46,3],[47,2,47,3],[48,2,48,3],[49,2,49,3],[50,2,50,3],[50,33,50,34],[51,2,51,3],[52,2,52,3],[53,2,53,3],[54,2,54,3],[55,2,55,3],[56,2,56,3],[57,2,57,3],[58,2,58,3],[59,2,59,3],[60,2,60,3],[61,2,61,3],[62,2,62,3],[63,2,63,3],[64,2,64,3],[65,2,65,3],[66,2,66,3],[68,6,68,10],[70,1,70,12],[72,1,72,12],[74,1,75,12],[76,1,76,12],[78,2,78,3],[78,4,78,5],[78,6,78,10],[79,1,79,12],[80,1,80,12],[81,1,81,12],[82,1,82,12]]}
["CONTROLE KOLOM",{"$f":"'Inschijfgeld ed'!B31","v":"v.v. 't Sieske"}]
[null,{"$f":"'Inschijfgeld ed'!B32","v":"Stein"}]
[null,{"$f":"'Inschijfgeld ed'!B33","v":"AANGESLOTEN BIJ DE NEDERLANDSE BOND VAN VOGELLIEFHEBBERS"}]
[]
[">>>","INSCHRIJFFORMULIER",{"$nulls":31},"VERGEET ONDERSTAANDE NIET IN TE VULLEN"]
[">>>",{"$f":"'Inschijfgeld ed'!B35","v":"Tentoonstelling 2025"},{"$nulls":31},"(als u een van de onderstaande correct ingevuld heeft is het vak groen)"]
["▼▼","Uitleg over wat u in de gele vakken in moet vullen? Ga met uw muis op het vakje staan met het rode hoekje.",{"$nulls":12},{"$f":"O8+O18","v":0},null,null,"Ja",{"$nulls":15},"Correct ingevuld","Nog niet en/of niet correct ingevuld","Regel"]
[">>>","Kweeknummer:",null,null,"TOTAAL INSCHRIJFGELD",{"$nulls":9},{"$f":"LEN(C8)","v":0},{"$f":"IF(O8=4,0,IF(C8=\"\",0,LEN(C8)))","v":0},null,"Nee",{"$nulls":8}," ",{"$nulls":6},"Kweeknummer nog invullen (verplicht) ",null,"C8"]
[">>>","Ander C.O.M. nummer:",null,null,"Enkelingen:",null,null,{"$f":"G68","v":0},"x",null,{"$f":"IF(C20=\"Ja\",'Inschijfgeld ed'!B9,'Inschijfgeld ed'!B8)","v":{"v":2,"d":"€ 2.00"}},"=",{"$f":"H9*K9","v":0},null,{"$f":"LEN(C9)","v":0},{"$f":"IF(O9<10,0,IF(C9=\"\",0,LEN(C9)))","v":0},{"$nulls":17},"Ander C.O.M. nummer invullen (niet verplicht) ",null,"C9"]
[">>>","Achternaam:",null,null,"Stellen:",null,null,{"$f":"H68","v":0},"x",null,{"$f":"IF(Y10=\"Nee\",0,IF(C20=\"Ja\",'Inschijfgeld ed'!B17,'Inschijfgeld ed'!B16))","v":{"v":4,"d":"€ 4.00"}},"=",{"$f":"H10*K10","v":0},null,{"$f":"LEN(C10)","v":0},{"$f":"IF(O10<45,0,IF(C10=\"\",0,LEN(C10)))","v":0},{"$nulls":3},"Naam Inzender",{"$nulls":4},{"$f":"'Inschijfgeld ed'!B63","v":"Ja"},{"$nulls":8},"Uw achternaam nog invullen (verplicht) ",null,"C10"]
[">>>","Tussenvoegsel:",null,null,"Stammen:",null,null,{"$f":"I68","v":0},"x",null,{"$f":"IF(Y11=\"Nee\",0,IF(C20=\"Ja\",'Inschijfgeld ed'!B13,'Inschijfgeld ed'!B12))","v":{"v":8,"d":"€ 8.00"}},"=",{"$f":"H11*K11","v":0},null,{"$f":"LEN(C11)","v":0},{"$f":"IF(O11<45,0,IF(C11=\"\",0,LEN(C11)))","v":0},{"$nulls":3},{"$f":"IF(C11=\"\", C10 & \" \" & C12,C10 & \" \" & C11 & \" \" & C12)","v":" "},{"$nulls":4},{"$f":"'Inschijfgeld ed'!B65","v":"Ja"},{"$nulls":8},"Eventueel uw tussenvoegsels nog invullen (indien van toepassing verplicht)",null,"C11"]
[">>>","Voorletters:",null,null,"Open Klasse (O.E.K.):",null,null,{"$f":"J68","v":0},"x",null,{"$f":"IF(Y12=\"Nee\",0,IF(C20=\"Ja\",'Inschijfgeld ed'!B9,'Inschijfgeld ed'!B8))","v":{"v":2,"d":"€ 2.00"}},"=",{"$f":"H12*K12","v":0},null,{"$f":"LEN(C12)","v":0},{"$f":"IF(O12<45,0,IF(C12=\"\",0,LEN(C12)))","v":0},{"$nulls":8},{"$f":"'Inschijfgeld ed'!B67","v":"Ja"},{"$nulls":8},"Uw voorletters nog invullen",null,"C12"]
[">>>","Adres:",null,null,"Open Klasse (O.K.):",null,null,{"$f":"K68","v":0},"x",null,{"$f":"IF(Y13=\"Nee\",0,IF(C20=\"Ja\",'Inschijfgeld ed'!B9,'Inschijfgeld ed'!B8))","v":{"v":0,"d":"€ 0.00"}},"=",{"$f":"H13*K13","v":0},null,{"$f":"LEN(C13)","v":0},{"$f":"IF(O13<30,0,IF(C13=\"\",0,LEN(C13)))","v":0},null,{"$f":"SUM(M9:M13)","v":0},"<< totaal M9 t/m M13",{"$nulls":5},{"$f":"'Inschijfgeld ed'!B69","v":"Nee"},{"$nulls":8},"Uw adres nog invullen (verplicht) ",null,"C13"]
[">>>","Postcode:",null,null,"Admi-, portokosten en verplichte catalogus:",{"$nulls":7},{"$f":"IF(C20=\"Ja\",'Inschijfgeld ed'!B21,'Inschijfgeld ed'!B20)","v":{"v":3.5,"d":"€ 3.50"}},null,0,{"$f":"IF(O14=7,0,IF(C14=\"\",0,LEN(C14)))","v":0},{"$nulls":17},"Uw postcode nog invullen (verplicht)",null,"C12"]
[">>>","Woonplaats:",null,null,{"$f":"Z15","v":"Huurkooien n.v.t."},null,null,{"$f":"M68","v":0},"x",null,{"$f":"IF(AL35=\"Nee\",0,IF(C20=\"Ja\",'Inschijfgeld ed'!B26,'Inschijfgeld ed'!B25))","v":{"v":0,"d":"€ 0.00"}},"=",{"$f":"H15*K15","v":0},null,0,{"$f":"IF(O15<30,0,IF(C15=\"\",0,LEN(C15)))","v":0},null,{"$f":"M14+M15","v":{"v":3.5,"d":"€ 3.50"}},"<< totaal M14 + M15",{"$nulls":5},{"$f":"IF(AL35=\"Nee\",1,0)","v":1},{"$f":"IF(Y15=1,\"Huurkooien n.v.t.\", \"Evt. Huurkooien\")","v":"Huurkooien n.v.t."},{"$nulls":7},"Uw woonplaats nog invullen (verplicht) ",null,"C13"]
[">>>","Telefoonnummer: ",null,null,"Extra bijdrage ",{"$nulls":6},"=",null,null,0,{"$f":"IF(O16<20,0,IF(C16=\"\",0,LEN(C16)))","v":0},{"$nulls":17},"Uw telefoonummer nog invullen (bijv. 000-0000000) (niet verplicht) ",null,"C14"]
[">>>","Mobielnummer: ",null,null,"U komt met het hier achterstaande aantal eigen kooien:",{"$nulls":6},{"$f":"G69-M68","v":0},"=====+",null,0,{"$f":"IF(O17<20,0,IF(C17=\"\",0,LEN(C17)))","v":0},null,"Max.In.",{"$nulls":15},"Uw mobielnummer nog invullen (bijv. 06-00000000) (niet verplicht) ",null,"C15"]
[">>>","Lid afdeling: (code)",null,{"$f":"IF(C18=\"\",\"\",IFERROR(VLOOKUP(C18,Verenigingen!A4:C452,3,FALSE),\"Onbekend\"))","v":""},{"$f":"IF(U18=0,W18,V18)","v":"  "},null,null,"Bekers",{"$nulls":3},"Te betalen:",{"$f":"S18","v":{"v":3.5,"d":"€ 3.50"}},null,0,{"$f":"IF(O18=3,0,IF(C18=\"\",0,LEN(C18)))","v":0},{"$f":"IF(D18=\"Onbekend\",1,0)","v":0},{"$f":"'Inschijfgeld ed'!B29","v":{"v":999.99,"d":"€ 999.99"}},{"$f":"IF(R13<R18,R13+R15+M16,R18+R15+M16)","v":{"v":3.5,"d":"€ 3.50"}},null,{"$f":"IF('Inschijfgeld ed'!B49= \"Uit\",1,0)","v":1},"  ","Uw prijskeuze is:",{"$nulls":10},"De code van uw verenigingen nog invullen (verplicht) ",null,"C16"]
[">>>","Lid Speciaalclub: (naam)","nvt",{"$f":"IF(C19=\"\",\"\",IFERROR(VLOOKUP(C19,Verenigingen!F4:G432,2,FALSE),\"Onbekend\"))","v":"N.V.T. Wordt niet gevraagd op deze TT"},{"$f":"S19& \" \" & X19","v":"Het max. inschrijfgeld bedraagt (excl. Admi-, portokosten en catalogus):"},{"$nulls":7},{"$f":"R18","v":{"v":999.99,"d":"€ 999.99"}},null,3,{"$f":"IF(O19=3,0,IF(C19=\"\",0,LEN(C19)))","v":0},null,{"$f":"IF(R18<999.99,1,0)","v":0},"Het max. inschrijfgeld bedraagt",{"$nulls":4},"(excl. Admi-, portokosten en catalogus):",{"$nulls":9},"De naam van de speciaalclub nog invullen via Dropdownbox (niet verplicht) ",null,"D17"]
[">>>","Jeugdinzender: (Ja/Nee)",null,"Jeugdinzender","Mogen er foto's van uw vogels gemaakt worden:",{"$nulls":6},"Nee",null,null,{"$f":"IF(C20=\"Ja\",1,IF(C20=\"Nee\",2,IF(C20=\"\",3)))","v":3},{"$f":"IF(C20= \"Ja\",1,0)","v":0},{"$nulls":3},{"$f":"L20","v":"Nee"},{"$nulls":13},"Jeugdinzender Ja/Nee nog aangeven (verplicht via Dropdownbox) ",null,"C18"]
[">>>","Geboortedatum:",null,null,{"$f":" \"Sluiting inschrijving: \" &'Inschijfgeld ed'!B37","v":"Sluiting inschrijving: 23 november 2025"},{"$nulls":9},{"$f":"LEN(C21)","v":0},null,"NVT J+K22",{"$nulls":16},"Bij jeugdinzender \"Ja\" geboorte datum invullen (DD-MM-JJJJ) (verplicht) ",null,"C19"]
[null,"KLASSE","Soort  en/of Kleurslag van de Vogel",null,"Soort","Aantal","Aantal",{"$f":"IF(AM26=0,\"Aantal\",\"NVT\")","v":"Aantal"},{"$f":"IF(AO26=0,\"Aantal\",\"NVT\")","v":"Aantal"},{"$f":"IF(AM31=0,\"Aantal\",\"NVT\")","v":"Aantal"},{"$f":"IF(AO31=0,\"Aantal\",\"NVT\")","v":"NVT"},"Verz.",{"$f":"IF(AM35=0,\"Aantal\",\"NVT\")","v":"NVT"},{"$nulls":3},{"$f":"IF(J22=\"NVT\",0,1)","v":1},{"$f":"IF(K22=\"NVT\",0,1)","v":0},null,"Totaal",{"$nulls":13},"U heeft uw E-mailadres nog niet ingevuld (Verplicht bij verzenden via E-mail)",null,"C77",{"$nulls":5},"Controle"]
[null,"zonder punten of komma's","Wordt automatisch ingevuld als u de juiste klasse intikt.",null,"kooi","jaren","Enkelingen","Stellen","Stammen","O.E.K.","OK","Bedrag ","Huurkooien",null,"Enk.","Stel","Stam","OEK","OK","vogels","Klasse","Omsch.","T+U","Kolom B","Kolom T","W+X",null,"Verz.",{"$nulls":13},"P","S","OEK","OK","HK"]
[">>>",null,{"$f":"IF(B24=\"\",\"\",IF(ISERROR(VLOOKUP(Inschrijfformulier!B24,Vraagprogramma!A:B,2,FALSE)),\"Onbekend\",(VLOOKUP(Inschrijfformulier!B24,Vraagprogramma!A:B,2,FALSE))))","v":""},null,{"$f":"IF(24=\" \",\" \",IF(ISERROR(VLOOKUP(Inschrijfformulier!C24,Vraagprogramma!B:D,3,FALSE)),\" \",(VLOOKUP(Inschrijfformulier!C24,Vraagprogramma!B:D,3,FALSE))))","v":" "},{"$f":"IF(24=\" \",\" \",IF(ISERROR(VLOOKUP(Inschrijfformulier!C24,Vraagprogramma!B:E,4,FALSE)),\" \",(VLOOKUP(Inschrijfformulier!C24,Vraagprogramma!B:E,4,FALSE))))","v":" "},{"$nulls":7},{"$f":"IF(T24>0,1,0)","v":0},{"$f":"LEN(G24)","v":0},{"$f":"LEN(H24)","v":0},{"$f":"LEN(I24)","v":0},{"$f":"LEN(J24)","v":0},{"$f":"LEN(K24)","v":0},{"$f":"G24+(H24*2)+(I24*4)+J24+K24","v":0},{"$f":"IF(B24=\"\",0,1)","v":0},{"$f":"IF(C24=\"Onbekend\",1,0)","v":0},{"$f":"T24+U24","v":0},{"$f":"IF(B24<>\"\",1,0)","v":0},{"$f":"IF(T24>0,1,0)","v":0},{"$f":"IF(Y24=1,IF(X24=1,2,1),0)","v":0},{"$f":"AB24+U24+N24","v":0},{"$f":"IF(L24<>\"\",1,0)","v":0},{"$f":"AA24+AB24","v":0},{"$f":"IF(AC24=0,1,0)","v":1},{"$f":"IF(AD24=1,0,0)","v":0},38,null,"INVOEREN VOGELS",null,"VB"," ","Stellen gevraagd",null,"Stammen gevraagd",null,{"$f":"IF($AM$26=1,IF(H24>0,3,0),0)","v":0},{"$f":"IF($AO$26=1,IF(I24>0,3,0),0)","v":0},{"$f":"IF($AM$31=1,IF(J24>0,3,0),0)","v":0},{"$f":"IF($AO$31=1,IF(K24>0,3,0),0)","v":0},{"$f":"IF($AM$35=1,IF(M24>0,3,0),0)","v":0}]
[">>>",null,{"$f":"IF(B25=\"\",\"\",IF(ISERROR(VLOOKUP(Inschrijfformulier!B25,Vraagprogramma!A:B,2,FALSE)),\"Onbekend\",(VLOOKUP(Inschrijfformulier!B25,Vraagprogramma!A:B,2,FALSE))))","v":""},null,{"$f":"IF(24=\" \",\" \",IF(ISERROR(VLOOKUP(Inschrijfformulier!C25,Vraagprogramma!B:D,3,FALSE)),\" \",(VLOOKUP(Inschrijfformulier!C25,Vraagprogramma!B:D,3,FALSE))))","v":" "},{"$f":"IF(24=\" \",\" \",IF(ISERROR(VLOOKUP(Inschrijfformulier!C25,Vraagprogramma!B:E,4,FALSE)),\" \",(VLOOKUP(Inschrijfformulier!C25,Vraagprogramma!B:E,4,FALSE))))","v":" "},{"$nulls":7},{"$f":"IF(T25>0,1,0)","v":0},0,0,0,0,0,0,0,{"$f":"IF(C25=\"Onbekend\",1,0)","v":0},0,0,0,{"$f":"IF(Y25=1,IF(X25=1,2,1),0)","v":0},0,0,{"$f":"AA25+AB25","v":0},1,{"$f":"IF(AD25=1,0,0)","v":0},37,null,"- Kolommen B24 tm B52 moet aansluitend gevuld worden",null,"LET OP !",{"$nulls":5},{"$f":"IF($AM$26=1,IF(H25>0,3,0),0)","v":0},{"$f":"IF($AO$26=1,IF(I25>0,3,0),0)","v":0},{"$f":"IF($AM$31=1,IF(J25>0,3,0),0)","v":0},{"$f":"IF($AO$31=1,IF(K25>0,3,0),0)","v":0},{"$f":"IF($AM$35=1,IF(M25>0,3,0),0)","v":0}]
[">>>",null,{"$f":"IF(B26=\"\",\"\",IF(ISERROR(VLOOKUP(Inschrijfformulier!B26,Vraagprogramma!A:B,2,FALSE)),\"Onbekend\",(VLOOKUP(Inschrijfformulier!B26,Vraagprogramma!A:B,2,FALSE))))","v":""},null,{"$f":"IF(24=\" \",\" \",IF(ISERROR(VLOOKUP(Inschrijfformulier!C26,Vraagprogramma!B:D,3,FALSE)),\" \",(VLOOKUP(Inschrijfformulier!C26,Vraagprogramma!B:D,3,FALSE))))","v":" "},{"$f":"IF(24=\" \",\" \",IF(ISERROR(VLOOKUP(Inschrijfformulier!C26,Vraagprogramma!B:E,4,FALSE)),\" \",(VLOOKUP(Inschrijfformulier!C26,Vraagprogramma!B:E,4,FALSE))))","v":" "},{"$nulls":7},0,0,0,0,0,0,0,0,0,0,0,0,0,0,0,0,1,{"$f":"IF(AD26=1,0,0)","v":0},36,null,"- Als u de vogels welke u wilt inschrijven correct zijn ingeschreven zal voor de ",null,">>>",null,{"$f":"'Inschijfgeld ed'!B63","v":"Ja"},{"$f":"IF(AL26=\"Nee\",1,0)","v":0},{"$f":"'Inschijfgeld ed'!B65","v":"Ja"},{"$f":"IF(AN26=\"Nee\",1,0)","v":0},0,0,0,0,0]
[">>>",null,{"$f":"IF(B27=\"\",\"\",IF(ISERROR(VLOOKUP(Inschrijfformulier!B27,Vraagprogramma!A:B,2,FALSE)),\"Onbekend\",(VLOOKUP(Inschrijfformulier!B27,Vraagprogramma!A:B,2,FALSE))))","v":""},null,{"$f":"IF(24=\" \",\" \",IF(ISERROR(VLOOKUP(Inschrijfformulier!C27,Vraagprogramma!B:D,3,FALSE)),\" \",(VLOOKUP(Inschrijfformulier!C27,Vraagprogramma!B:D,3,FALSE))))","v":" "},{"$f":"IF(24=\" \",\" \",IF(ISERROR(VLOOKUP(Inschrijfformulier!C27,Vraagprogramma!B:E,4,FALSE)),\" \",(VLOOKUP(Inschrijfformulier!C27,Vraagprogramma!B:E,4,FALSE))))","v":" "},{"$nulls":7},0,0,0,0,0,0,0,0,0,0,0,0,0,0,0,0,1,{"$f":"IF(AD27=1,0,0)","v":0},35,null,"klasse het vakje groen worden. (kolom A)",{"$nulls":7},0,0,0,0,0]
[">>>",null,{"$f":"IF(B28=\"\",\"\",IF(ISERROR(VLOOKUP(Inschrijfformulier!B28,Vraagprogramma!A:B,2,FALSE)),\"Onbekend\",(VLOOKUP(Inschrijfformulier!B28,Vraagprogramma!A:B,2,FALSE))))","v":""},null,{"$f":"IF(24=\" \",\" \",IF(ISERROR(VLOOKUP(Inschrijfformulier!C28,Vraagprogramma!B:D,3,FALSE)),\" \",(VLOOKUP(Inschrijfformulier!C28,Vraagprogramma!B:D,3,FALSE))))","v":" "},{"$f":"IF(24=\" \",\" \",IF(ISERROR(VLOOKUP(Inschrijfformulier!C28,Vraagprogramma!B:E,4,FALSE)),\" \",(VLOOKUP(Inschrijfformulier!C28,Vraagprogramma!B:E,4,FALSE))))","v":" "},{"$nulls":7},0,0,0,0,0,0,0,0,0,0,0,0,0,0,0,0,1,{"$f":"IF(AD28=1,0,0)","v":0},34,null,"- Als nog niet alles is ingevuld zal het vakje voor de klasse roze/bruin kleuren.",null,">>>",{"$nulls":5},0,0,0,0,0]
[">>>",null,{"$f":"IF(B29=\"\",\"\",IF(ISERROR(VLOOKUP(Inschrijfformulier!B29,Vraagprogramma!A:B,2,FALSE)),\"Onbekend\",(VLOOKUP(Inschrijfformulier!B29,Vraagprogramma!A:B,2,FALSE))))","v":""},null,{"$f":"IF(24=\" \",\" \",IF(ISERROR(VLOOKUP(Inschrijfformulier!C29,Vraagprogramma!B:D,3,FALSE)),\" \",(VLOOKUP(Inschrijfformulier!C29,Vraagprogramma!B:D,3,FALSE))))","v":" "},{"$f":"IF(24=\" \",\" \",IF(ISERROR(VLOOKUP(Inschrijfformulier!C29,Vraagprogramma!B:E,4,FALSE)),\" \",(VLOOKUP(Inschrijfformulier!C29,Vraagprogramma!B:E,4,FALSE))))","v":" "},{"$nulls":7},0,0,0,0,0,0,0,0,0,0,0,0,0,0,0,0,1,{"$f":"IF(AD29=1,0,0)","v":0},33,null,"- Als in de kolom (B24 t/m B52) een dubbele klasse ingevoerd wordt,worden",null,{"v":1001001,"d":"1,001,001"},null,"OEK vogels gevraagd",null,"OK vogels gevraagd",null,0,0,0,0,0]
[">>>",null,{"$f":"IF(B30=\"\",\"\",IF(ISERROR(VLOOKUP(Inschrijfformulier!B30,Vraagprogramma!A:B,2,FALSE)),\"Onbekend\",(VLOOKUP(Inschrijfformulier!B30,Vraagprogramma!A:B,2,FALSE))))","v":""},null,{"$f":"IF(24=\" \",\" \",IF(ISERROR(VLOOKUP(Inschrijfformulier!C30,Vraagprogramma!B:D,3,FALSE)),\" \",(VLOOKUP(Inschrijfformulier!C30,Vraagprogramma!B:D,3,FALSE))))","v":" "},{"$f":"IF(24=\" \",\" \",IF(ISERROR(VLOOKUP(Inschrijfformulier!C30,Vraagprogramma!B:E,4,FALSE)),\" \",(VLOOKUP(Inschrijfformulier!C30,Vraagprogramma!B:E,4,FALSE))))","v":" "},{"$nulls":7},0,0,0,0,0,0,0,0,0,0,0,0,0,0,0,0,1,0,32,null,"de vakjes roze met rode letter verschijnen. U mag maar 1 regel per ",{"$nulls":7},0,0,0,0,0]
[">>>",null,{"$f":"IF(B31=\"\",\"\",IF(ISERROR(VLOOKUP(Inschrijfformulier!B31,Vraagprogramma!A:B,2,FALSE)),\"Onbekend\",(VLOOKUP(Inschrijfformulier!B31,Vraagprogramma!A:B,2,FALSE))))","v":""},null,{"$f":"IF(24=\" \",\" \",IF(ISERROR(VLOOKUP(Inschrijfformulier!C31,Vraagprogramma!B:D,3,FALSE)),\" \",(VLOOKUP(Inschrijfformulier!C31,Vraagprogramma!B:D,3,FALSE))))","v":" "},{"$f":"IF(24=\" \",\" \",IF(ISERROR(VLOOKUP(Inschrijfformulier!C31,Vraagprogramma!B:E,4,FALSE)),\" \",(VLOOKUP(Inschrijfformulier!C31,Vraagprogramma!B:E,4,FALSE))))","v":" "},{"$nulls":7},0,0,0,0,0,0,0,0,0,0,0,0,0,0,0,0,1,0,31,null,"klasse gebruiken. Verwijder dus 1 regel en zet de aantallen bij de eerste regel.",{"$nulls":3},{"$f":"'Inschijfgeld ed'!B67","v":"Ja"},{"$f":"IF(AL31=\"Nee\",1,0)","v":0},{"$f":"'Inschijfgeld ed'!B69","v":"Nee"},{"$f":"IF(AN31=\"Nee\",1,0)","v":1},0,0,0,0,0]
[">>>",null,{"$f":"IF(B32=\"\",\"\",IF(ISERROR(VLOOKUP(Inschrijfformulier!B32,Vraagprogramma!A:B,2,FALSE)),\"Onbekend\",(VLOOKUP(Inschrijfformulier!B32,Vraagprogramma!A:B,2,FALSE))))","v":""},null,{"$f":"IF(24=\" \",\" \",IF(ISERROR(VLOOKUP(Inschrijfformulier!C32,Vraagprogramma!B:D,3,FALSE)),\" \",(VLOOKUP(Inschrijfformulier!C32,Vraagprogramma!B:D,3,FALSE))))","v":" "},{"$f":"IF(24=\" \",\" \",IF(ISERROR(VLOOKUP(Inschrijfformulier!C32,Vraagprogramma!B:E,4,FALSE)),\" \",(VLOOKUP(Inschrijfformulier!C32,Vraagprogramma!B:E,4,FALSE))))","v":" "},{"$nulls":7},0,0,0,0,0,0,0,0,0,0,0,0,0,0,0,0,1,0,30,{"$nulls":9},0,0,0,0,0]
[">>>",null,{"$f":"IF(B33=\"\",\"\",IF(ISERROR(VLOOKUP(Inschrijfformulier!B33,Vraagprogramma!A:B,2,FALSE)),\"Onbekend\",(VLOOKUP(Inschrijfformulier!B33,Vraagprogramma!A:B,2,FALSE))))","v":""},null,{"$f":"IF(24=\" \",\" \",IF(ISERROR(VLOOKUP(Inschrijfformulier!C33,Vraagprogramma!B:D,3,FALSE)),\" \",(VLOOKUP(Inschrijfformulier!C33,Vraagprogramma!B:D,3,FALSE))))","v":" "},{"$f":"IF(24=\" \",\" \",IF(ISERROR(VLOOKUP(Inschrijfformulier!C33,Vraagprogramma!B:E,4,FALSE)),\" \",(VLOOKUP(Inschrijfformulier!C33,Vraagprogramma!B:E,4,FALSE))))","v":" "},{"$nulls":7},0,0,0,0,0,0,0,0,0,0,0,0,0,0,0,0,1,0,29,null,"TABBLAD VRAAGPROGRAMMA",{"$nulls":3},"Huurkooien gevraagd",{"$nulls":3},0,0,0,0,0]
[">>>",null,{"$f":"IF(B34=\"\",\"\",IF(ISERROR(VLOOKUP(Inschrijfformulier!B34,Vraagprogramma!A:B,2,FALSE)),\"Onbekend\",(VLOOKUP(Inschrijfformulier!B34,Vraagprogramma!A:B,2,FALSE))))","v":""},null,{"$f":"IF(24=\" \",\" \",IF(ISERROR(VLOOKUP(Inschrijfformulier!C34,Vraagprogramma!B:D,3,FALSE)),\" \",(VLOOKUP(Inschrijfformulier!C34,Vraagprogramma!B:D,3,FALSE))))","v":" "},{"$f":"IF(24=\" \",\" \",IF(ISERROR(VLOOKUP(Inschrijfformulier!C34,Vraagprogramma!B:E,4,FALSE)),\" \",(VLOOKUP(Inschrijfformulier!C34,Vraagprogramma!B:E,4,FALSE))))","v":" "},{"$nulls":7},0,0,0,0,0,0,0,0,0,0,0,0,0,0,0,0,1,0,28,null,"In het tabblad \"Vraagprogramma\" vindt u het complete vraagprogramma ",{"$nulls":7},0,0,0,0,0]
[">>>",null,{"$f":"IF(B35=\"\",\"\",IF(ISERROR(VLOOKUP(Inschrijfformulier!B35,Vraagprogramma!A:B,2,FALSE)),\"Onbekend\",(VLOOKUP(Inschrijfformulier!B35,Vraagprogramma!A:B,2,FALSE))))","v":""},null,{"$f":"IF(24=\" \",\" \",IF(ISERROR(VLOOKUP(Inschrijfformulier!C35,Vraagprogramma!B:D,3,FALSE)),\" \",(VLOOKUP(Inschrijfformulier!C35,Vraagprogramma!B:D,3,FALSE))))","v":" "},{"$f":"IF(24=\" \",\" \",IF(ISERROR(VLOOKUP(Inschrijfformulier!C35,Vraagprogramma!B:E,4,FALSE)),\" \",(VLOOKUP(Inschrijfformulier!C35,Vraagprogramma!B:E,4,FALSE))))","v":" "},{"$nulls":7},0,0,0,0,0,0,0,0,0,0,0,0,0,0,0,0,1,0,27,null,"2025-2029",{"$nulls":3},{"$f":"'Inschijfgeld ed'!B24","v":"Nee"},{"$f":"IF(AL35=\"Nee\",1,0)","v":1},null,null,0,0,0,0,0]
[">>>",null,{"$f":"IF(B36=\"\",\"\",IF(ISERROR(VLOOKUP(Inschrijfformulier!B36,Vraagprogramma!A:B,2,FALSE)),\"Onbekend\",(VLOOKUP(Inschrijfformulier!B36,Vraagprogramma!A:B,2,FALSE))))","v":""},null,{"$f":"IF(24=\" \",\" \",IF(ISERROR(VLOOKUP(Inschrijfformulier!C36,Vraagprogramma!B:D,3,FALSE)),\" \",(VLOOKUP(Inschrijfformulier!C36,Vraagprogramma!B:D,3,FALSE))))","v":" "},{"$f":"IF(24=\" \",\" \",IF(ISERROR(VLOOKUP(Inschrijfformulier!C36,Vraagprogramma!B:E,4,FALSE)),\" \",(VLOOKUP(Inschrijfformulier!C36,Vraagprogramma!B:E,4,FALSE))))","v":" "},{"$nulls":7},0,0,0,0,0,0,0,0,0,0,0,0,0,0,0,0,1,0,26,null,"U kunt hier, via een zoekfunctie, op een gemakkelijke manier het klasse-",{"$nulls":7},0,0,0,0,0]
[">>>",null,{"$f":"IF(B37=\"\",\"\",IF(ISERROR(VLOOKUP(Inschrijfformulier!B37,Vraagprogramma!A:B,2,FALSE)),\"Onbekend\",(VLOOKUP(Inschrijfformulier!B37,Vraagprogramma!A:B,2,FALSE))))","v":""},null,{"$f":"IF(24=\" \",\" \",IF(ISERROR(VLOOKUP(Inschrijfformulier!C37,Vraagprogramma!B:D,3,FALSE)),\" \",(VLOOKUP(Inschrijfformulier!C37,Vraagprogramma!B:D,3,FALSE))))","v":" "},{"$f":"IF(24=\" \",\" \",IF(ISERROR(VLOOKUP(Inschrijfformulier!C37,Vraagprogramma!B:E,4,FALSE)),\" \",(VLOOKUP(Inschrijfformulier!C37,Vraagprogramma!B:E,4,FALSE))))","v":" "},{"$nulls":7},0,0,0,0,0,0,0,0,0,0,0,0,0,0,0,0,1,0,25,null,"nummer vinden van de vogel welke u wilt inschrijven.",{"$nulls":7},0,0,0,0,0]
[">>>",null,{"$f":"IF(B38=\"\",\"\",IF(ISERROR(VLOOKUP(Inschrijfformulier!B38,Vraagprogramma!A:B,2,FALSE)),\"Onbekend\",(VLOOKUP(Inschrijfformulier!B38,Vraagprogramma!A:B,2,FALSE))))","v":""},null,{"$f":"IF(24=\" \",\" \",IF(ISERROR(VLOOKUP(Inschrijfformulier!C38,Vraagprogramma!B:D,3,FALSE)),\" \",(VLOOKUP(Inschrijfformulier!C38,Vraagprogramma!B:D,3,FALSE))))","v":" "},{"$f":"IF(24=\" \",\" \",IF(ISERROR(VLOOKUP(Inschrijfformulier!C38,Vraagprogramma!B:E,4,FALSE)),\" \",(VLOOKUP(Inschrijfformulier!C38,Vraagprogramma!B:E,4,FALSE))))","v":" "},{"$nulls":7},0,0,0,0,0,0,0,0,0,0,0,0,0,0,0,0,1,0,24,null,"Hoe deze functie werk vindt u op het tabblad \"Vraagprogramma\"",{"$nulls":7},0,0,0,0,0]
[">>>",null,{"$f":"IF(B39=\"\",\"\",IF(ISERROR(VLOOKUP(Inschrijfformulier!B39,Vraagprogramma!A:B,2,FALSE)),\"Onbekend\",(VLOOKUP(Inschrijfformulier!B39,Vraagprogramma!A:B,2,FALSE))))","v":""},null,{"$f":"IF(24=\" \",\" \",IF(ISERROR(VLOOKUP(Inschrijfformulier!C39,Vraagprogramma!B:D,3,FALSE)),\" \",(VLOOKUP(Inschrijfformulier!C39,Vraagprogramma!B:D,3,FALSE))))","v":" "},{"$f":"IF(24=\" \",\" \",IF(ISERROR(VLOOKUP(Inschrijfformulier!C39,Vraagprogramma!B:E,4,FALSE)),\" \",(VLOOKUP(Inschrijfformulier!C39,Vraagprogramma!B:E,4,FALSE))))","v":" "},{"$nulls":7},0,0,0,0,0,0,0,0,0,0,0,0,0,0,0,0,1,0,23,{"$nulls":9},0,0,0,0,0]
[">>>",null,{"$f":"IF(B40=\"\",\"\",IF(ISERROR(VLOOKUP(Inschrijfformulier!B40,Vraagprogramma!A:B,2,FALSE)),\"Onbekend\",(VLOOKUP(Inschrijfformulier!B40,Vraagprogramma!A:B,2,FALSE))))","v":""},null,{"$f":"IF(24=\" \",\" \",IF(ISERROR(VLOOKUP(Inschrijfformulier!C40,Vraagprogramma!B:D,3,FALSE)),\" \",(VLOOKUP(Inschrijfformulier!C40,Vraagprogramma!B:D,3,FALSE))))","v":" "},{"$f":"IF(24=\" \",\" \",IF(ISERROR(VLOOKUP(Inschrijfformulier!C40,Vraagprogramma!B:E,4,FALSE)),\" \",(VLOOKUP(Inschrijfformulier!C40,Vraagprogramma!B:E,4,FALSE))))","v":" "},{"$nulls":7},0,0,0,0,0,0,0,0,0,0,0,0,0,0,0,0,1,0,22,null,"TABBLAD HANDLEIDING",{"$nulls":7},0,0,0,0,0]
[">>>",null,{"$f":"IF(B41=\"\",\"\",IF(ISERROR(VLOOKUP(Inschrijfformulier!B41,Vraagprogramma!A:B,2,FALSE)),\"Onbekend\",(VLOOKUP(Inschrijfformulier!B41,Vraagprogramma!A:B,2,FALSE))))","v":""},null,{"$f":"IF(24=\" \",\" \",IF(ISERROR(VLOOKUP(Inschrijfformulier!C41,Vraagprogramma!B:D,3,FALSE)),\" \",(VLOOKUP(Inschrijfformulier!C41,Vraagprogramma!B:D,3,FALSE))))","v":" "},{"$f":"IF(24=\" \",\" \",IF(ISERROR(VLOOKUP(Inschrijfformulier!C41,Vraagprogramma!B:E,4,FALSE)),\" \",(VLOOKUP(Inschrijfformulier!C41,Vraagprogramma!B:E,4,FALSE))))","v":" "},{"$nulls":7},0,0,0,0,0,0,0,0,0,0,0,0,0,0,0,0,1,0,21,null,"In het tabblad \"Handleiding\" vindt u hoe u het beste dit formulier kunt",{"$nulls":7},0,0,0,0,0]
[">>>",null,{"$f":"IF(B42=\"\",\"\",IF(ISERROR(VLOOKUP(Inschrijfformulier!B42,Vraagprogramma!A:B,2,FALSE)),\"Onbekend\",(VLOOKUP(Inschrijfformulier!B42,Vraagprogramma!A:B,2,FALSE))))","v":""},null,{"$f":"IF(24=\" \",\" \",IF(ISERROR(VLOOKUP(Inschrijfformulier!C42,Vraagprogramma!B:D,3,FALSE)),\" \",(VLOOKUP(Inschrijfformulier!C42,Vraagprogramma!B:D,3,FALSE))))","v":" "},{"$f":"IF(24=\" \",\" \",IF(ISERROR(VLOOKUP(Inschrijfformulier!C42,Vraagprogramma!B:E,4,FALSE)),\" \",(VLOOKUP(Inschrijfformulier!C42,Vraagprogramma!B:E,4,FALSE))))","v":" "},{"$nulls":7},0,0,0,0,0,0,0,0,0,0,0,0,0,0,0,0,1,0,20,null,"invullen en versturen.",{"$nulls":7},0,0,0,0,0]
[">>>",null,{"$f":"IF(B43=\"\",\"\",IF(ISERROR(VLOOKUP(Inschrijfformulier!B43,Vraagprogramma!A:B,2,FALSE)),\"Onbekend\",(VLOOKUP(Inschrijfformulier!B43,Vraagprogramma!A:B,2,FALSE))))","v":""},null,{"$f":"IF(24=\" \",\" \",IF(ISERROR(VLOOKUP(Inschrijfformulier!C43,Vraagprogramma!B:D,3,FALSE)),\" \",(VLOOKUP(Inschrijfformulier!C43,Vraagprogramma!B:D,3,FALSE))))","v":" "},{"$f":"IF(24=\" \",\" \",IF(ISERROR(VLOOKUP(Inschrijfformulier!C43,Vraagprogramma!B:E,4,FALSE)),\" \",(VLOOKUP(Inschrijfformulier!C43,Vraagprogramma!B:E,4,FALSE))))","v":" "},{"$nulls":7},0,0,0,0,0,0,0,0,0,0,0,0,0,0,0,0,1,0,19,{"$nulls":9},0,0,0,0,0]
[">>>",null,{"$f":"IF(B44=\"\",\"\",IF(ISERROR(VLOOKUP(Inschrijfformulier!B44,Vraagprogramma!A:B,2,FALSE)),\"Onbekend\",(VLOOKUP(Inschrijfformulier!B44,Vraagprogramma!A:B,2,FALSE))))","v":""},null,{"$f":"IF(24=\" \",\" \",IF(ISERROR(VLOOKUP(Inschrijfformulier!C44,Vraagprogramma!B:D,3,FALSE)),\" \",(VLOOKUP(Inschrijfformulier!C44,Vraagprogramma!B:D,3,FALSE))))","v":" "},{"$f":"IF(24=\" \",\" \",IF(ISERROR(VLOOKUP(Inschrijfformulier!C44,Vraagprogramma!B:E,4,FALSE)),\" \",(VLOOKUP(Inschrijfformulier!C44,Vraagprogramma!B:E,4,FALSE))))","v":" "},{"$nulls":7},0,0,0,0,0,0,0,0,0,0,0,0,0,0,0,0,1,0,18,null,"OPSLAAN EN VERSTUREN",{"$nulls":7},0,0,0,0,0]
[">>>",null,{"$f":"IF(B45=\"\",\"\",IF(ISERROR(VLOOKUP(Inschrijfformulier!B45,Vraagprogramma!A:B,2,FALSE)),\"Onbekend\",(VLOOKUP(Inschrijfformulier!B45,Vraagprogramma!A:B,2,FALSE))))","v":""},null,{"$f":"IF(24=\" \",\" \",IF(ISERROR(VLOOKUP(Inschrijfformulier!C45,Vraagprogramma!B:D,3,FALSE)),\" \",(VLOOKUP(Inschrijfformulier!C45,Vraagprogramma!B:D,3,FALSE))))","v":" "},{"$f":"IF(24=\" \",\" \",IF(ISERROR(VLOOKUP(Inschrijfformulier!C45,Vraagprogramma!B:E,4,FALSE)),\" \",(VLOOKUP(Inschrijfformulier!C45,Vraagprogramma!B:E,4,FALSE))))","v":" "},{"$nulls":7},0,0,0,0,0,0,0,0,0,0,0,0,0,0,0,0,1,0,17,null,"Als u klaar bent met invullen van het formulier moet u het formulier eerst ",{"$nulls":7},0,0,0,0,0]
[">>>",null,{"$f":"IF(B46=\"\",\"\",IF(ISERROR(VLOOKUP(Inschrijfformulier!B46,Vraagprogramma!A:B,2,FALSE)),\"Onbekend\",(VLOOKUP(Inschrijfformulier!B46,Vraagprogramma!A:B,2,FALSE))))","v":""},null,{"$f":"IF(24=\" \",\" \",IF(ISERROR(VLOOKUP(Inschrijfformulier!C46,Vraagprogramma!B:D,3,FALSE)),\" \",(VLOOKUP(Inschrijfformulier!C46,Vraagprogramma!B:D,3,FALSE))))","v":" "},{"$f":"IF(24=\" \",\" \",IF(ISERROR(VLOOKUP(Inschrijfformulier!C46,Vraagprogramma!B:E,4,FALSE)),\" \",(VLOOKUP(Inschrijfformulier!C46,Vraagprogramma!B:E,4,FALSE))))","v":" "},{"$nulls":7},0,0,0,0,0,0,0,0,0,0,0,0,0,0,0,0,1,0,16,null,"opslaan op uw bureaublad of waar u het later terug kunt vinden.",{"$nulls":7},0,0,0,0,0]
[">>>",null,{"$f":"IF(B47=\"\",\"\",IF(ISERROR(VLOOKUP(Inschrijfformulier!B47,Vraagprogramma!A:B,2,FALSE)),\"Onbekend\",(VLOOKUP(Inschrijfformulier!B47,Vraagprogramma!A:B,2,FALSE))))","v":""},null,{"$f":"IF(24=\" \",\" \",IF(ISERROR(VLOOKUP(Inschrijfformulier!C47,Vraagprogramma!B:D,3,FALSE)),\" \",(VLOOKUP(Inschrijfformulier!C47,Vraagprogramma!B:D,3,FALSE))))","v":" "},{"$f":"IF(24=\" \",\" \",IF(ISERROR(VLOOKUP(Inschrijfformulier!C47,Vraagprogramma!B:E,4,FALSE)),\" \",(VLOOKUP(Inschrijfformulier!C47,Vraagprogramma!B:E,4,FALSE))))","v":" "},{"$nulls":7},0,0,0,0,0,0,0,0,0,0,0,0,0,0,0,0,1,0,15,null,"Geef het formulier dan als naam uw kweeknummer plus uw naam.",{"$nulls":7},0,0,0,0,0]
[">>>",null,{"$f":"IF(B48=\"\",\"\",IF(ISERROR(VLOOKUP(Inschrijfformulier!B48,Vraagprogramma!A:B,2,FALSE)),\"Onbekend\",(VLOOKUP(Inschrijfformulier!B48,Vraagprogramma!A:B,2,FALSE))))","v":""},null,{"$f":"IF(24=\" \",\" \",IF(ISERROR(VLOOKUP(Inschrijfformulier!C48,Vraagprogramma!B:D,3,FALSE)),\" \",(VLOOKUP(Inschrijfformulier!C48,Vraagprogramma!B:D,3,FALSE))))","v":" "},{"$f":"IF(24=\" \",\" \",IF(ISERROR(VLOOKUP(Inschrijfformulier!C48,Vraagprogramma!B:E,4,FALSE)),\" \",(VLOOKUP(Inschrijfformulier!C48,Vraagprogramma!B:E,4,FALSE))))","v":" "},{"$nulls":7},0,0,0,0,0,0,0,0,0,0,0,0,0,0,0,0,1,0,14,null,"(voorbeeld: XXXX Naam)",{"$nulls":7},0,0,0,0,0]
[">>>",null,{"$f":"IF(B49=\"\",\"\",IF(ISERROR(VLOOKUP(Inschrijfformulier!B49,Vraagprogramma!A:B,2,FALSE)),\"Onbekend\",(VLOOKUP(Inschrijfformulier!B49,Vraagprogramma!A:B,2,FALSE))))","v":""},null,{"$f":"IF(24=\" \",\" \",IF(ISERROR(VLOOKUP(Inschrijfformulier!C49,Vraagprogramma!B:D,3,FALSE)),\" \",(VLOOKUP(Inschrijfformulier!C49,Vraagprogramma!B:D,3,FALSE))))","v":" "},{"$f":"IF(24=\" \",\" \",IF(ISERROR(VLOOKUP(Inschrijfformulier!C49,Vraagprogramma!B:E,4,FALSE)),\" \",(VLOOKUP(Inschrijfformulier!C49,Vraagprogramma!B:E,4,FALSE))))","v":" "},{"$nulls":7},0,0,0,0,0,0,0,0,0,0,0,0,0,0,0,0,1,0,13,null,"Vervolgens verzendt u dit formulier met uw eigen E-mailprogramma naar ",{"$nulls":7},0,0,0,0,0]
[">>>",null,{"$f":"IF(B50=\"\",\"\",IF(ISERROR(VLOOKUP(Inschrijfformulier!B50,Vraagprogramma!A:B,2,FALSE)),\"Onbekend\",(VLOOKUP(Inschrijfformulier!B50,Vraagprogramma!A:B,2,FALSE))))","v":""},null,{"$f":"IF(24=\" \",\" \",IF(ISERROR(VLOOKUP(Inschrijfformulier!C50,Vraagprogramma!B:D,3,FALSE)),\" \",(VLOOKUP(Inschrijfformulier!C50,Vraagprogramma!B:D,3,FALSE))))","v":" "},{"$f":"IF(24=\" \",\" \",IF(ISERROR(VLOOKUP(Inschrijfformulier!C50,Vraagprogramma!B:E,4,FALSE)),\" \",(VLOOKUP(Inschrijfformulier!C50,Vraagprogramma!B:E,4,FALSE))))","v":" "},{"$nulls":7},0,0,0,0,0,0,0,0,0,0,0,0,0,0,0,0,1,0,12,null,"het hier onderstaande E-mailadres:",{"$nulls":7},0,0,0,0,0]
[">>>",null,{"$f":"IF(B51=\"\",\"\",IF(ISERROR(VLOOKUP(Inschrijfformulier!B51,Vraagprogramma!A:B,2,FALSE)),\"Onbekend\",(VLOOKUP(Inschrijfformulier!B51,Vraagprogramma!A:B,2,FALSE))))","v":""},null,{"$f":"IF(24=\" \",\" \",IF(ISERROR(VLOOKUP(Inschrijfformulier!C51,Vraagprogramma!B:D,3,FALSE)),\" \",(VLOOKUP(Inschrijfformulier!C51,Vraagprogramma!B:D,3,FALSE))))","v":" "},{"$f":"IF(24=\" \",\" \",IF(ISERROR(VLOOKUP(Inschrijfformulier!C51,Vraagprogramma!B:E,4,FALSE)),\" \",(VLOOKUP(Inschrijfformulier!C51,Vraagprogramma!B:E,4,FALSE))))","v":" "},{"$nulls":7},0,0,0,0,0,0,0,0,0,0,0,0,0,0,0,0,1,0,11,null,{"$f":"'Inschijfgeld ed'!B39","v":"sieskestein@gmail.com"},{"$nulls":7},0,0,0,0,0]
[">>>",null,{"$f":"IF(B52=\"\",\"\",IF(ISERROR(VLOOKUP(Inschrijfformulier!B52,Vraagprogramma!A:B,2,FALSE)),\"Onbekend\",(VLOOKUP(Inschrijfformulier!B52,Vraagprogramma!A:B,2,FALSE))))","v":""},null,{"$f":"IF(24=\" \",\" \",IF(ISERROR(VLOOKUP(Inschrijfformulier!C52,Vraagprogramma!B:D,3,FALSE)),\" \",(VLOOKUP(Inschrijfformulier!C52,Vraagprogramma!B:D,3,FALSE))))","v":" "},{"$f":"IF(24=\" \",\" \",IF(ISERROR(VLOOKUP(Inschrijfformulier!C52,Vraagprogramma!B:E,4,FALSE)),\" \",(VLOOKUP(Inschrijfformulier!C52,Vraagprogramma!B:E,4,FALSE))))","v":" "},{"$nulls":7},0,0,0,0,0,0,0,0,0,0,0,0,0,0,0,0,1,0,10,{"$nulls":9},0,0,0,0,0]
[">>>",null,{"$f":"IF(B53=\"\",\"\",IF(ISERROR(VLOOKUP(Inschrijfformulier!B53,Vraagprogramma!A:B,2,FALSE)),\"Onbekend\",(VLOOKUP(Inschrijfformulier!B53,Vraagprogramma!A:B,2,FALSE))))","v":""},null,{"$f":"IF(24=\" \",\" \",IF(ISERROR(VLOOKUP(Inschrijfformulier!C53,Vraagprogramma!B:D,3,FALSE)),\" \",(VLOOKUP(Inschrijfformulier!C53,Vraagprogramma!B:D,3,FALSE))))","v":" "},{"$f":"IF(24=\" \",\" \",IF(ISERROR(VLOOKUP(Inschrijfformulier!C53,Vraagprogramma!B:E,4,FALSE)),\" \",(VLOOKUP(Inschrijfformulier!C53,Vraagprogramma!B:E,4,FALSE))))","v":" "},{"$nulls":7},0,0,0,0,0,0,0,0,0,0,0,0,0,0,0,0,1,0,9,{"$nulls":9},0,0,0,0,0]
[">>>",null,{"$f":"IF(B54=\"\",\"\",IF(ISERROR(VLOOKUP(Inschrijfformulier!B54,Vraagprogramma!A:B,2,FALSE)),\"Onbekend\",(VLOOKUP(Inschrijfformulier!B54,Vraagprogramma!A:B,2,FALSE))))","v":""},null,{"$f":"IF(24=\" \",\" \",IF(ISERROR(VLOOKUP(Inschrijfformulier!C54,Vraagprogramma!B:D,3,FALSE)),\" \",(VLOOKUP(Inschrijfformulier!C54,Vraagprogramma!B:D,3,FALSE))))","v":" "},{"$f":"IF(24=\" \",\" \",IF(ISERROR(VLOOKUP(Inschrijfformulier!C54,Vraagprogramma!B:E,4,FALSE)),\" \",(VLOOKUP(Inschrijfformulier!C54,Vraagprogramma!B:E,4,FALSE))))","v":" "},{"$nulls":7},0,0,0,0,0,0,0,0,0,0,0,0,0,0,0,0,1,0,8,{"$nulls":9},0,0,0,0,0]
[">>>",null,{"$f":"IF(B55=\"\",\"\",IF(ISERROR(VLOOKUP(Inschrijfformulier!B55,Vraagprogramma!A:B,2,FALSE)),\"Onbekend\",(VLOOKUP(Inschrijfformulier!B55,Vraagprogramma!A:B,2,FALSE))))","v":""},null,{"$f":"IF(24=\" \",\" \",IF(ISERROR(VLOOKUP(Inschrijfformulier!C55,Vraagprogramma!B:D,3,FALSE)),\" \",(VLOOKUP(Inschrijfformulier!C55,Vraagprogramma!B:D,3,FALSE))))","v":" "},{"$f":"IF(24=\" \",\" \",IF(ISERROR(VLOOKUP(Inschrijfformulier!C55,Vraagprogramma!B:E,4,FALSE)),\" \",(VLOOKUP(Inschrijfformulier!C55,Vraagprogramma!B:E,4,FALSE))))","v":" "},{"$nulls":7},0,0,0,0,0,0,0,0,0,0,0,0,0,0,0,0,1,0,7,{"$nulls":9},0,0,0,0,0]
[">>>",null,{"$f":"IF(B56=\"\",\"\",IF(ISERROR(VLOOKUP(Inschrijfformulier!B56,Vraagprogramma!A:B,2,FALSE)),\"Onbekend\",(VLOOKUP(Inschrijfformulier!B56,Vraagprogramma!A:B,2,FALSE))))","v":""},null,{"$f":"IF(24=\" \",\" \",IF(ISERROR(VLOOKUP(Inschrijfformulier!C56,Vraagprogramma!B:D,3,FALSE)),\" \",(VLOOKUP(Inschrijfformulier!C56,Vraagprogramma!B:D,3,FALSE))))","v":" "},{"$f":"IF(24=\" \",\" \",IF(ISERROR(VLOOKUP(Inschrijfformulier!C56,Vraagprogramma!B:E,4,FALSE)),\" \",(VLOOKUP(Inschrijfformulier!C56,Vraagprogramma!B:E,4,FALSE))))","v":" "},{"$nulls":7},0,0,0,0,0,0,0,0,0,0,0,0,0,0,0,0,1,0,6,{"$nulls":9},0,0,0,0,0]
[">>>",null,{"$f":"IF(B57=\"\",\"\",IF(ISERROR(VLOOKUP(Inschrijfformulier!B57,Vraagprogramma!A:B,2,FALSE)),\"Onbekend\",(VLOOKUP(Inschrijfformulier!B57,Vraagprogramma!A:B,2,FALSE))))","v":""},null,{"$f":"IF(24=\" \",\" \",IF(ISERROR(VLOOKUP(Inschrijfformulier!C57,Vraagprogramma!B:D,3,FALSE)),\" \",(VLOOKUP(Inschrijfformulier!C57,Vraagprogramma!B:D,3,FALSE))))","v":" "},{"$f":"IF(24=\" \",\" \",IF(ISERROR(VLOOKUP(Inschrijfformulier!C57,Vraagprogramma!B:E,4,FALSE)),\" \",(VLOOKUP(Inschrijfformulier!C57,Vraagprogramma!B:E,4,FALSE))))","v":" "},{"$nulls":7},0,0,0,0,0,0,0,0,0,0,0,0,0,0,0,0,1,0,5,{"$nulls":9},0,0,0,0,0]
[">>>",null,{"$f":"IF(B58=\"\",\"\",IF(ISERROR(VLOOKUP(Inschrijfformulier!B58,Vraagprogramma!A:B,2,FALSE)),\"Onbekend\",(VLOOKUP(Inschrijfformulier!B58,Vraagprogramma!A:B,2,FALSE))))","v":""},null,{"$f":"IF(24=\" \",\" \",IF(ISERROR(VLOOKUP(Inschrijfformulier!C58,Vraagprogramma!B:D,3,FALSE)),\" \",(VLOOKUP(Inschrijfformulier!C58,Vraagprogramma!B:D,3,FALSE))))","v":" "},{"$f":"IF(24=\" \",\" \",IF(ISERROR(VLOOKUP(Inschrijfformulier!C58,Vraagprogramma!B:E,4,FALSE)),\" \",(VLOOKUP(Inschrijfformulier!C58,Vraagprogramma!B:E,4,FALSE))))","v":" "},{"$nulls":7},0,0,0,0,0,0,0,0,0,0,0,0,0,0,0,0,1,0,4,{"$nulls":9},0,0,0,0,0]
[">>>",null,{"$f":"IF(B59=\"\",\"\",IF(ISERROR(VLOOKUP(Inschrijfformulier!B59,Vraagprogramma!A:B,2,FALSE)),\"Onbekend\",(VLOOKUP(Inschrijfformulier!B59,Vraagprogramma!A:B,2,FALSE))))","v":""},null,{"$f":"IF(24=\" \",\" \",IF(ISERROR(VLOOKUP(Inschrijfformulier!C59,Vraagprogramma!B:D,3,FALSE)),\" \",(VLOOKUP(Inschrijfformulier!C59,Vraagprogramma!B:D,3,FALSE))))","v":" "},{"$f":"IF(24=\" \",\" \",IF(ISERROR(VLOOKUP(Inschrijfformulier!C59,Vraagprogramma!B:E,4,FALSE)),\" \",(VLOOKUP(Inschrijfformulier!C59,Vraagprogramma!B:E,4,FALSE))))","v":" "},{"$nulls":7},0,0,0,0,0,0,0,0,0,0,0,0,0,0,0,0,1,0,3,{"$nulls":9},0,0,0,0,0]
[">>>",null,{"$f":"IF(B60=\"\",\"\",IF(ISERROR(VLOOKUP(Inschrijfformulier!B60,Vraagprogramma!A:B,2,FALSE)),\"Onbekend\",(VLOOKUP(Inschrijfformulier!B60,Vraagprogramma!A:B,2,FALSE))))","v":""},null,{"$f":"IF(24=\" \",\" \",IF(ISERROR(VLOOKUP(Inschrijfformulier!C60,Vraagprogramma!B:D,3,FALSE)),\" \",(VLOOKUP(Inschrijfformulier!C60,Vraagprogramma!B:D,3,FALSE))))","v":" "},{"$f":"IF(24=\" \",\" \",IF(ISERROR(VLOOKUP(Inschrijfformulier!C60,Vraagprogramma!B:E,4,FALSE)),\" \",(VLOOKUP(Inschrijfformulier!C60,Vraagprogramma!B:E,4,FALSE))))","v":" "},{"$nulls":7},0,0,0,0,0,0,0,0,0,0,0,0,0,0,0,0,1,0,2,{"$nulls":9},0,0,0,0,0]
[">>>",null,{"$f":"IF(B61=\"\",\"\",IF(ISERROR(VLOOKUP(Inschrijfformulier!B61,Vraagprogramma!A:B,2,FALSE)),\"Onbekend\",(VLOOKUP(Inschrijfformulier!B61,Vraagprogramma!A:B,2,FALSE))))","v":""},null,{"$f":"IF(24=\" \",\" \",IF(ISERROR(VLOOKUP(Inschrijfformulier!C61,Vraagprogramma!B:D,3,FALSE)),\" \",(VLOOKUP(Inschrijfformulier!C61,Vraagprogramma!B:D,3,FALSE))))","v":" "},{"$f":"IF(24=\" \",\" \",IF(ISERROR(VLOOKUP(Inschrijfformulier!C61,Vraagprogramma!B:E,4,FALSE)),\" \",(VLOOKUP(Inschrijfformulier!C61,Vraagprogramma!B:E,4,FALSE))))","v":" "},{"$nulls":7},0,0,0,0,0,0,0,0,0,0,0,0,0,0,0,0,1,0,1,{"$nulls":9},0,0,0,0,0]
[">>>",null,{"$f":"IF(B62=\"\",\"\",IF(ISERROR(VLOOKUP(Inschrijfformulier!B62,Vraagprogramma!A:B,2,FALSE)),\"Onbekend\",(VLOOKUP(Inschrijfformulier!B62,Vraagprogramma!A:B,2,FALSE))))","v":""},null,{"$f":"IF(24=\" \",\" \",IF(ISERROR(VLOOKUP(Inschrijfformulier!C62,Vraagprogramma!B:D,3,FALSE)),\" \",(VLOOKUP(Inschrijfformulier!C62,Vraagprogramma!B:D,3,FALSE))))","v":" "},{"$f":"IF(24=\" \",\" \",IF(ISERROR(VLOOKUP(Inschrijfformulier!C62,Vraagprogramma!B:E,4,FALSE)),\" \",(VLOOKUP(Inschrijfformulier!C62,Vraagprogramma!B:E,4,FALSE))))","v":" "},{"$nulls":7},0,0,0,0,0,0,0,0,0,0,0,0,0,0,0,0,1,0,0,{"$nulls":9},0,0,0,0,0]
[">>>",{"$nulls":3},{"$f":"IF(24=\" \",\" \",IF(ISERROR(VLOOKUP(Inschrijfformulier!C63,Vraagprogramma!B:D,3,FALSE)),\" \",(VLOOKUP(Inschrijfformulier!C63,Vraagprogramma!B:D,3,FALSE))))","v":" "},{"$nulls":8},0,0,0,0,0,0,0,0,0,0,0,0,0,0,0,0,1,0,{"$nulls":10},0,0,0,0,0]
[">>>",null,{"$f":"IF(24=\" \",\" \",IF(ISERROR(VLOOKUP(Inschrijfformulier!B64,Vraagprogramma!A:B,2,FALSE)),\" \",(VLOOKUP(Inschrijfformulier!B64,Vraagprogramma!A:B,2,FALSE))))","v":" "},null,{"$f":"IF(24=\" \",\" \",IF(ISERROR(VLOOKUP(Inschrijfformulier!C64,Vraagprogramma!B:D,3,FALSE)),\" \",(VLOOKUP(Inschrijfformulier!C64,Vraagprogramma!B:D,3,FALSE))))","v":" "},{"$nulls":8},0,0,0,0,0,0,0,0,0,0,0,0,0,0,0,0,1,0,{"$nulls":10},0,0,0,0,0]
[">>>",null,{"$f":"IF(24=\" \",\" \",IF(ISERROR(VLOOKUP(Inschrijfformulier!B65,Vraagprogramma!A:B,2,FALSE)),\" \",(VLOOKUP(Inschrijfformulier!B65,Vraagprogramma!A:B,2,FALSE))))","v":" "},null,{"$f":"IF(24=\" \",\" \",IF(ISERROR(VLOOKUP(Inschrijfformulier!C65,Vraagprogramma!B:D,3,FALSE)),\" \",(VLOOKUP(Inschrijfformulier!C65,Vraagprogramma!B:D,3,FALSE))))","v":" "},{"$nulls":8},0,0,0,0,0,0,0,0,0,0,0,0,0,0,0,0,1,0,{"$nulls":10},0,0,0,0,0]
[">>>",null,{"$f":"IF(24=\" \",\" \",IF(ISERROR(VLOOKUP(Inschrijfformulier!B66,Vraagprogramma!A:B,2,FALSE)),\" \",(VLOOKUP(Inschrijfformulier!B66,Vraagprogramma!A:B,2,FALSE))))","v":" "},null,{"$f":"IF(24=\" \",\" \",IF(ISERROR(VLOOKUP(Inschrijfformulier!C66,Vraagprogramma!B:D,3,FALSE)),\" \",(VLOOKUP(Inschrijfformulier!C66,Vraagprogramma!B:D,3,FALSE))))","v":" "},{"$nulls":8},0,0,0,0,0,0,0,0,0,0,0,0,0,0,0,0,1,0,{"$nulls":10},0,0,0,0,0]
[">>>",null,{"$f":"IF(24=\" \",\" \",IF(ISERROR(VLOOKUP(Inschrijfformulier!B67,Vraagprogramma!A:B,2,FALSE)),\" \",(VLOOKUP(Inschrijfformulier!B67,Vraagprogramma!A:B,2,FALSE))))","v":" "},null,{"$f":"IF(24=\" \",\" \",IF(ISERROR(VLOOKUP(Inschrijfformulier!C67,Vraagprogramma!B:D,3,FALSE)),\" \",(VLOOKUP(Inschrijfformulier!C67,Vraagprogramma!B:D,3,FALSE))))","v":" "},{"$nulls":8},0,0,0,0,0,0,0,0,0,0,0,0,0,0,0,0,1,0,{"$nulls":10},0,0,0,0,0]
["Versie:","2025.1",{"$nulls":3},"Totaal:",{"$f":"SUM(G24:G67)","v":0},{"$f":"SUM(H24:H67)","v":0},{"$f":"SUM(I24:I67)","v":0},{"$f":"IF(Q22=0,0,SUM(J24:J67))","v":0},{"$f":"IF(R22=0,0,SUM(K24:K67))","v":0},{"$f":"SUM(L24:L67)","v":{"v":0,"d":"€ 0.00"}},{"$f":"SUM(M24:M67)","v":0},0,{"$nulls":7},0,{"$nulls":4},0,{"$f":"SUM(AB24:AB67)","v":0},0,1,0]
[{"$nulls":5},"Totaal aantal vogels:",{"$f":"G68+(H68*2)+(I68*4)+J68+K68","v":0},{"$nulls":6},0,{"$nulls":7},0,{"$nulls":4},0,null,0,{"$f":"SUM(AD24:AD68)","v":45},0]
[{"$nulls":21},0,{"$nulls":7},{"$f":"IF(AD69>0,1,0)","v":1},0]
[null,"Raadpleeg bij invulling het vraagprogramma en vermeld duidelijk de klassenummers. Op afwijkende kooien wordt streng gecontroleerd.",{"$nulls":19},0,{"$nulls":8},0]
[]
[null,"Ondergetekende verklaart dat de hiervoor vermelde ingeschreven vogels zijn/haar eigendom zijn en dat hij/zij inschrijft onder de voor deze"]
[{"$nulls":4},{"$f":"'Inschijfgeld ed'!B47","v":"Tentoonstelling 2025 geldende voorwaarden (zie reglement)"}]
[null,"Het inschrijfgeld kunt u overmaken naar: "]
[]
[null,{"$f":"'Inschijfgeld ed'!B43 & \", \" &'Inschijfgeld ed'!B41","v":"NL08 RABO 0149243529, t.n.v. 't Sieske"}]
[]
[">>>","E-mailadres:  ",null,null,"Datum: ",null,{"$f":"TODAY()","v":"2025-10-27"}]
[null,"Als u klaar bent met invullen van het formulier moet u het formulier eerst opslaan op uw bureaublad."]
[null,"Geef het formulier dan als naam uw kweeknummer plus uw naam (voorbeeld: XXXX Naam)"]
[null,"Vervolgens verzendt u dit formulier met uw eigen E-mailprogramma naar het hier onderstaande E-mailadres"]
[null,{"$f":"'Inschijfgeld ed'!B39","v":"sieskestein@gmail.com"}]

{"sheet":"Vraagprogramma","index":1,"n_rows":6579,"n_cols":8,"rows_kept":6579,"merged":[[0,0,0,4],[0,6,0,7]]}
["VRAAGPROGRAMMA 2025-2029 (VERSIE: SEPTEMBER 2025)",{"$nulls":5},"UITLEG, HOE GEBRUIKT U DE ZOEKFUNCTIE"]
["Klasse","Soort",null,"Kooi","Aantal jaar",null,"Om in deze lijst te kunnen zoeken naar een klasse-nummer kunt u de zoekfunctie gebruiken."]
[1001001,"ZangKan.Harzer kloekvrij",null,"01",1,null,"Deze zoekfunctie activeert u door de CTRL-knop op uw toetsenbord ingedrukt te houden"]
[1001002,"ZangKan.Harzer met kloeken",null,"01",1,null,"en dan vervolgens op de letter F te klikken. Dan verschijnt het hieronder staand scherm."]
[1002001,"ZangKan.Waterslagers",null,"01",1]
[1003001,"ZangKan.Timbrado original",null,"01",2]
[1003002,"ZangKan.Timbrado floreado",null,"01",2]
[2001001,"Kl.Kan.Lipochroom wit dominant",null,"02",2]
[2002001,"Kl.Kan.Lipochroom wit",null,"02",2]
[2003001,"Kl.Kan.Lipochroom albino dominant",null,"02",2]
[2004001,"Kl.Kan.Lipochroom albino",null,"02",2]
[2005001,"Kl.Kan.Lipochroom geel intensief",null,"02",2,null,"Vervolgens kunt u in het vakje achter \"Zoeken naar\" de naam, of een gedeelte daarvan, van de"]
[2005002,"Kl.Kan.Lipochroom geelivoor intensief",null,"02",2,null,"gewenste vogel intikken. Vervolgens klikt u met uw muis op de knop \"Volgende zoeken\"."]
[2006001,"Kl.Kan.Lipochroom geel intensief witte pennen",null,"02",2,null,"Als u dan uw vogel gevonden heeft staat voor de naam het klasse-nummer en dit nummer gebruikt"]
[2006002,"Kl.Kan.Lipochroom geelivoor intensief witte pennen",null,"02",2,null,"u vervolgens in het tabblad \"Inschrijfformulier\". En als u dit klasse-nummer heeft ingetikt (niet kopieren/plakken)"]
[2007001,"Kl.Kan.Lipochroom lutino intensief",null,"02",2,null,"verschijnt de naam van uw vogel in het vakje er naast."]
[2007002,"Kl.Kan.Lipochroom lutino-ivoor intensief",null,"02",2,null,"Heeft u nog niet de juiste vogel gevonden dan klikt u met uw muis weer op de knop \"Volgende zoeken\""]
[2008001,"Kl.Kan.Lutino intensief witte pennen",null,"02",2,null,"Dit doet u net zolang tot dat u uw gewenste vogel gevonden heeft."]
[2008002,"Kl.Kan.Lutino-ivoor intensief witte pennen",null,"02",2,null,"Als u klaar bent met zoeken kunt u, in het zoekscherm op de knop \"Sluiten\" klikken met uw muis."]
[2009001,"Kl.Kan.Lipochroom geel schimmel",null,"02",2]
[2009002,"Kl.Kan.Lipochroom geelivoor schimmel",null,"02",2,null,"In de kolom:"]
[2010001,"Kl.Kan.Lipochroom geel schimmel witte pennen",null,"02",2,null,"Klasse (kolom A):","Staat het klasse-nummer, voor het gewenste klasse-nummer in (kolom B, regel 22 t/m 60)"]
[2010002,"Kl.Kan.Lipochroom geelivoor schimmel witte pennen",null,"02",2,null,null,"in het tabblad \"Inschrijfformulier\"."]
[2011001,"Kl.Kan.Lipochroom lutino schimmel",null,"02",2,null,"Soort (kolom B): ","Staat de naam en eventueel de kleurslag (*)."]
[2011002,"Kl.Kan.Lipochroom lutino-ivoor schimmel",null,"02",2,null,"Kooi (kolom C):","Staat het nummer van de soortkooi waar de vogel in tentoongesteld moet worden (*)."]
[2012001,"Kl.Kan.Lipochroom lutino schimmel witte pennen",null,"02",2,null,"Aantal jaar (kolom D):","Staat hoeveel jaar een vogel mee mag doen als eigenkweekvogel (*)."]
[2012002,"Kl.Kan.Lipochroom lutino-ivoor schimmel witte pennen",null,"02",2]
[2013001,"Kl.Kan.Lipochroom geel mozaiek T1",null,"02",2,null,null,"(*) Deze gegevens worden automatisch in het tabblad \"Inschrijfformulier\" in de juiste vakken"]
[2013002,"Kl.Kan.Lipochroom geel-ivoor mozaiek T1",null,"02",2,null,null,"ingevoerd als u het klasse-nummer in het tabblad \"Inschrijfformulier\" heeft ingevoerd."]
[2014001,"Kl.Kan.Lipochroom lutino mozaiek T1",null,"02",2]
[2014002,"Kl.Kan.Lipochroom lutino-ivoor mozaiek T1",null,"02",2]
[2015001,"Kl.Kan.Lipochroom geel mozaiek T2",null,"02",2]
[2015002,"Kl.Kan.Lipochroom geel-ivoor mozaiek T2",null,"02",2]
[2016001,"Kl.Kan.Lipochroom lutino mozaiek T2",null,"02",2]
[2016002,"Kl.Kan.Lipochroom lutino-ivoor mozaiek T2",null,"02",2]
[2017001,"Kl.Kan.Lipochroom rood intensief",null,"02",2]
[2017002,"Kl.Kan.Lipochroom roodivoor intensief",null,"02",2]
[2018001,"Kl.Kan.Lipochroom rood intensief witte pennen",null,"02",2]
[2018002,"Kl.Kan.Lipochroom roodivoor intensief witte pennen",null,"02",2]
[2019001,"Kl.Kan.Lipochroom rubino intensief",null,"02",2]
[2019002,"Kl.Kan.Lipochroom rubino-ivoor intensief",null,"02",2]
[2020001,"Kl.Kan.Lipochroom rubino intensief witte pennen",null,"02",2]
[2020002,"Kl.Kan.Lipochroom rubino-ivoor intensief witte pennen",null,"02",2]
[2021001,"Kl.Kan.Lipochroom rood schimmel",null,"02",2]
[2021002,"Kl.Kan.Lipochroom roodivoor schimmel",null,"02",2]
[2022001,"Kl.Kan.Lipochroom schimmel witte pennen",null,"02",2]
[2022002,"Kl.Kan.Lipochroom roodivoor schimmel witte pennen",null,"02",2]
[2023001,"Kl.Kan.Lipochroom rubino schimmel",null,"02",2]
[2023002,"Kl.Kan.Lipochroom rubino-ivoor schimmel",null,"02",2]
[2024001,"Kl.Kan.Lipochroom rubino schimmel witte pennen",null,"02",2]
[2024002,"Kl.Kan.Lipochroom rubino-ivoor schimmel witte pennen",null,"02",2]
[2025001,"Kl.Kan.Lipochroom rood mozaiek T1",null,"02",2]
[2025002,"Kl.Kan.Lipochroom rubino mozaiek T1",null,"02",2]
[2026001,"Kl.Kan.Lipochroom roodivoor mozaiek T1",null,"02",2]
[2026002,"Kl.Kan.Lipochroom rubino-ivoor mozaiek T1",null,"02",2]
[2027001,"Kl.Kan.Lipochroom rood mozaiek T2",null,"02",2]
[2027002,"Kl.Kan.Lipochroom rubino mozaiek T2",null,"02",2]
[2028001,"Kl.Kan.Lipochroom roodivoor mozaiek T2",null,"02",2]
[2028002,"Kl.Kan.Lipochroom rubino-ivoor mozaiek T2",null,"02",2]
[2029001,"Kl.Kan.Lipochroom roodsnavel rood intensief",null,"02",2]
[2029002,"Kl.Kan.Lipochroom roodsnavel roodivoor intensief",null,"02",2]
[2029003,"Kl.Kan.Lipochroom roodsnavel rubino intensief",null,"02",2]
[2029004,"Kl.Kan.Lipochroom roodsnavel rubino-ivoor intensief",null,"02",2]
[2029005,"Kl.Kan.Lipochroom roodsnavel rood schimmel",null,"02",2]
[2029006,"Kl.Kan.Lipochroom roodsnavel roodivoor schimmel",null,"02",2]
[2029007,"Kl.Kan.Lipochroom roodsnavel rubino schimmel",null,"02",2]
[2029008,"Kl.Kan.Lipochroom roodsnavel rubino-ivoor schimmel",null,"02",2]
[2030001,"Kl.Kan.Lipochroom geelsnavel geel intensief",null,"02",2]
[2030002,"Kl.Kan.Lipochroom geelsnavel geel-ivoor intensief",null,"02",2]
[2030003,"Kl.Kan.Lipochroom geelsnavel lutino intensief",null,"02",2]
[2030004,"Kl.Kan.Lipochroom geelsnavel lutino ivoor intensief",null,"02",2]
[2030005,"Kl.Kan.Lipochroom geelsnavel geel schimmel",null,"02",2]
[2030006,"Kl.Kan.Lipochroom geelsnavel geelivoor schimmel",null,"02",2]
[2030007,"Kl.Kan.Lipochroom geelsnavel lutino schimmel",null,"02",2]
[2030008,"Kl.Kan.Lipochroom geelsnavel lutino-ivoor schimmel",null,"02",2]
[2031001,"Kl.Kan.Melanine zwart wit dominant",null,"02",2]
[2032001,"Kl.Kan.Melanine zwart wit",null,"02",2]
[2033001,"Kl.Kan.Melanine zwart geel intensief",null,"02",2]
[2033002,"Kl.Kan.Melanine zwart geelivoor intensief",null,"02",2]
[2034001,"Kl.Kan.Melanine zwart geel schimmel",null,"02",2]
[2034002,"Kl.Kan.Melanine zwart geelivoor schimmel",null,"02",2]
[2035001,"Kl.Kan.Melanine zwart rood intensief",null,"02",2]
[2035002,"Kl.Kan.Melanine zwart roodivoor intensief",null,"02",2]
[2036001,"Kl.Kan.Melanine zwart rood schimmel",null,"02",2]
[2036002,"Kl.Kan.Melanine zwart roodivoor schimmel",null,"02",2]
[2037001,"Kl.Kan.Melanine zwart geel mozaiek T1",null,"02",2]
[2037002,"Kl.Kan.Melanine zwart geelivoor mozaiek T1",null,"02",2]
[2038001,"Kl.Kan.Melanine zwart geel mozaiek T2",null,"02",2]
[2038002,"Kl.Kan.Melanine zwart geelivoor mozaiek T2",null,"02",2]
[2041001,"Kl.Kan.Melanine zwart rood mozaiek T1",null,"02",2]
[2041002,"Kl.Kan.Melanine zwart roodivoor mozaiek T1",null,"02",2]
[2042001,"Kl.Kan.Melanine zwart rood mozaiek T2",null,"02",2]
[2042002,"Kl.Kan.Melanine zwart roodivoor mozaiek T2",null,"02",2]
[2043001,"Kl.Kan.Melanine bruin wit dominant",null,"02",2]
[2044001,"Kl.Kan.Melanine bruin wit",null,"02",2]
[2045001,"Kl.Kan.Melanine bruin geel intensief",null,"02",2]
[2045002,"Kl.Kan.Melanine bruin geelivoor intensief",null,"02",2]
[2046001,"Kl.Kan.Melanine bruin geel schimmel",null,"02",2]
[2046002,"Kl.Kan.Melanine bruin geelivoor schimmel",null,"02",2]
[2047001,"Kl.Kan.Melanine bruin rood intensief",null,"02",2]
[2047002,"Kl.Kan.Melanine bruin roodivoor intensief",null,"02",2]
[2048001,"Kl.Kan.Melanine bruin rood schimmel",null,"02",2]
[2048002,"Kl.Kan.Melanine bruin roodivoor schimmel",null,"02",2]
[2049001,"Kl.Kan.Melanine bruin geel mozaiek T1",null,"02",2]
[2049002,"Kl.Kan.Melanine bruin geelivoor mozaiek T1",null,"02",2]
[2050001,"Kl.Kan.Melanine bruin geel mozaiek T2",null,"02",2]
[2050002,"Kl.Kan.Melanine bruin geelivoor mozaiek T2",null,"02",2]
[2051001,"Kl.Kan.Melanine bruin rood mozaiek T1",null,"02",2]
[2051002,"Kl.Kan.Melanine bruin roodivoor mozaiek T1",null,"02",2]
[2053001,"Kl.Kan.Melanine bruin rood mozaiek T2",null,"02",2]
[2053002,"Kl.Kan.Melanine bruin roodivoor mozaiek T2",null,"02",2]
[2057001,"Kl.Kan.Melanine agaat wit dominant",null,"02",2]
[2058001,"Kl.Kan.Melanine agaat wit",null,"02",2]
[2059001,"Kl.Kan.Melanine agaat geel intensief",null,"02",2]
[2059002,"Kl.Kan.Melanine agaat geelivoor intensief",null,"02",2]
[2060001,"Kl.Kan.Melanine agaat geel schimmel",null,"02",2]
[2060002,"Kl.Kan.Melanine agaat geelivoor schimmel",null,"02",2]
[2061001,"Kl.Kan.Melanine agaat rood intensief",null,"02",2]
[2061002,"Kl.Kan.Melanine agaat roodivoor intensief",null,"02",2]
[2062001,"Kl.Kan.Melanine agaat rood schimmel",null,"02",2]
[2062002,"Kl.Kan.Melanine agaat roodivoor schimmel",null,"02",2]
[2063001,"Kl.Kan.Melanine agaat geel mozaiek T1",null,"02",2]
[2063002,"Kl.Kan.Melanine agaat geelivoor mozaiek T1",null,"02",2]
[2065001,"Kl.Kan.Melanine agaat geel mozaiek T2",null,"02",2]
[2065002,"Kl.Kan.Melanine agaat geelivoor mozaiek T2",null,"02",2]
[2067001,"Kl.Kan.Melanine agaat rood mozaiek T1",null,"02",2]
[2067002,"Kl.Kan.Melanine agaat roodivoor mozaiek T1",null,"02",2]
[2069001,"Kl.Kan.Melanine agaat rood mozaiek T2",null,"02",2]
[2069002,"Kl.Kan.Melanine agaat roodivoor mozaiek T2",null,"02",2]
[2071001,"Kl.Kan.Melanine isabel wit dominant",null,"02",2]
[2072001,"Kl.Kan.Melanine isabel wit",null,"02",2]
[2073001,"Kl.Kan.Melanine isabel geel intensief",null,"02",2]
[2073002,"Kl.Kan.Melanine isabel geelivoor intensief",null,"02",2]
[2074001,"Kl.Kan.Melanine isabel geel schimmel",null,"02",2]
[2074002,"Kl.Kan.Melanine isabel geelivoor schimmel",null,"02",2]
[2075001,"Kl.Kan.Melanine isabel rood intensief",null,"02",2]
[2075002,"Kl.Kan.Melanine isabel roodivoor intensief",null,"02",2]
[2076001,"Kl.Kan.Melanine isabel rood schimmel",null,"02",2]
[2076002,"Kl.Kan.Melanine isabel roodivoor schimmel",null,"02",2]
[2077001,"Kl.Kan.Melanine isabel geel mozaiek T1",null,"02",2]
[2077002,"Kl.Kan.Melanine isabel geelivoor mozaiek T1",null,"02",2]
[2079001,"Kl.Kan.Melanine isabel geel mozaiek T2",null,"02",2]
[2079002,"Kl.Kan.Melanine isabel geelivoor mozaiek T2",null,"02",2]
[2081001,"Kl.Kan.Melanine isabel rood mozaiek T1",null,"02",2]
[2081002,"Kl.Kan.Melanine isabel roodivoor mozaiek T1",null,"02",2]
[2083001,"Kl.Kan.Melanine isabel rood mozaiek T2",null,"02",2]
[2083002,"Kl.Kan.Melanine isabel roodivoor mozaiek T2",null,"02",2]
[2085001,"Kl.Kan.Melanine zwartpastel wit dominant",null,"02",2]
[2086001,"Kl.Kan.Melanine zwartpastel wit",null,"02",2]
[2087001,"Kl.Kan.Melanine zwartpastel geel intensief",null,"02",2]
[2087002,"Kl.Kan.Melanine zwartpastel geelivoor intensief",null,"02",2]
[2088001,"Kl.Kan.Melanine zwartpastel geel schimmel",null,"02",2]
[2088002,"Kl.Kan.Melanine zwartpastel geelivoor schimmel",null,"02",2]
[2089001,"Kl.Kan.Melanine zwartpastel rood intensief",null,"02",2]
[2089002,"Kl.Kan.Melanine zwartpastel roodivoor intensief",null,"02",2]
[2090001,"Kl.Kan.Melanine zwartpastel rood schimmel",null,"02",2]
[2090002,"Kl.Kan.Melanine zwartpastel roodivoor schimmel",null,"02",2]
[2091001,"Kl.Kan.Melanine zwartpastel geel mozaiek T1",null,"02",2]
[2091002,"Kl.Kan.Melanine zwartpastel geelivoor mozaiek T1",null,"02",2]
[2093001,"Kl.Kan.Melanine zwartpastel geel mozaiek T2",null,"02",2]
[2093002,"Kl.Kan.Melanine zwartpastel geelivoor mozaiek T2",null,"02",2]
[2095001,"Kl.Kan.Melanine zwartpastel rood mozaiek T1",null,"02",2]
[2095002,"Kl.Kan.Melanine zwartpastel roodivoor mozaiek T1",null,"02",2]
[2097001,"Kl.Kan.Melanine zwartpastel rood mozaiek T2",null,"02",2]
[2097002,"Kl.Kan.Melanine zwartpastel roodivoor mozaiek T2",null,"02",2]
[2099001,"Kl.Kan.Melanine bruinpastel wit dominant",null,"02",2]
[2100001,"Kl.Kan.Melanine bruinpastel wit",null,"02",2]
[2101001,"Kl.Kan.Melanine bruinpastel geel intensief",null,"02",2]
[2101002,"Kl.Kan.Melanine bruinpastel geelivoor intensief",null,"02",2]
[2102001,"Kl.Kan.Melanine bruinpastel geel schimmel",null,"02",2]
[2102002,"Kl.Kan.Melanine bruinpastel geelivoor schimmel",null,"02",2]
[2103001,"Kl.Kan.Melanine bruinpastel rood intensief",null,"02",2]
[2103002,"Kl.Kan.Melanine bruinpastel roodivoor intensief",null,"02",2]
[2104001,"Kl.Kan.Melanine bruinpastel rood schimmel",null,"02",2]
[2104002,"Kl.Kan.Melanine bruinpastel roodivoor schimmel",null,"02",2]
[2105001,"Kl.Kan.Melanine bruinpastel geel mozaiek T1",null,"02",2]
[2105002,"Kl.Kan.Melanine bruinpastel geelivoor mozaiek T1",null,"02",2]
[2107001,"Kl.Kan.Melanine bruinpastel geel mozaiek T2",null,"02",2]
[2107002,"Kl.Kan.Melanine bruinpastel geelivoor mozaiek T2",null,"02",2]
[2109001,"Kl.Kan.Melanine bruinpastel rood mozaiek T1",null,"02",2]
[2109002,"Kl.Kan.Melanine bruinpastel roodivoor mozaiek T1",null,"02",2]
[2111001,"Kl.Kan.Melanine bruinpastel rood mozaiek T2",null,"02",2]
[2111002,"Kl.Kan.Melanine bruinpastel roodivoor mozaiek T2",null,"02",2]
[2113001,"Kl.Kan.Melanine agaatpastel wit dominant",null,"02",2]
[2114001,"Kl.Kan.Melanine agaatpastel wit",null,"02",2]
[2115001,"Kl.Kan.Melanine agaatpastel geel intensief",null,"02",2]
[2115002,"Kl.Kan.Melanine agaatpastel geelivoor intensief",null,"02",2]
[2116001,"Kl.Kan.Melanine agaatpastel geel schimmel",null,"02",2]
[2116002,"Kl.Kan.Melanine agaatpastel geelivoor schimmel",null,"02",2]
[2117001,"Kl.Kan.Melanine agaatpastel rood intensief",null,"02",2]
[2117002,"Kl.Kan.Melanine agaatpastel roodivoor intensief",null,"02",2]
[2118001,"Kl.Kan.Melanine agaatpastel rood schimmel",null,"02",2]
[2118002,"Kl.Kan.Melanine agaatpastel roodivoor schimmel",null,"02",2]
[2119001,"Kl.Kan.Melanine agaatpastel geel mozaiek T1",null,"02",2]
[2119002,"Kl.Kan.Melanine agaatpastel geelivoor mozaiek T1",null,"02",2]
[2121001,"Kl.Kan.Melanine agaatpastel geel mozaiek T2",null,"02",2]
[2121002,"Kl.Kan.Melanine agaatpastel geelivoor mozaiek T2",null,"02",2]
[2123001,"Kl.Kan.Melanine agaatpastel rood mozaiek T1",null,"02",2]
[2123002,"Kl.Kan.Melanine agaatpastel roodivoor mozaiek T1",null,"02",2]
[2124001,"Kl.Kan.Melanine agaatpastel rood mozaiek T2",null,"02",2]
[2124002,"Kl.Kan.Melanine agaatpastel roodivoor mozaiek T2",null,"02",2]
[2125001,"Kl.Kan.Melanine isabelpastel wit dominant",null,"02",2]
[2126001,"Kl.Kan.Melanine isabelpastel wit",null,"02",2]
[2127001,"Kl.Kan.Melanine isabelpastel geel intensief",null,"02",2]
[2127002,"Kl.Kan.Melanine isabelpastel geelivoor intensief",null,"02",2]
[2128001,"Kl.Kan.Melanine isabelpastel geel schimmel",null,"02",2]
[2128002,"Kl.Kan.Melanine isabelpastel geelivoor schimmel",null,"02",2]
[2129001,"Kl.Kan.Melanine isabelpastel rood intensief",null,"02",2]
[2129002,"Kl.Kan.Melanine isabelpastel roodivoor intensief",null,"02",2]
[2130001,"Kl.Kan.Melanine isabelpastel rood schimmel",null,"02",2]
[2130002,"Kl.Kan.Melanine isabelpastel roodivoor schimmel",null,"02",2]
[2131001,"Kl.Kan.Melanine isabelpastel geel mozaiek T1",null,"02",2]
[2131002,"Kl.Kan.Melanine isabelpastel geelivoor mozaiek T1",null,"02",2]
[2133003,"Kl.Kan.Melanine isabelpastel geel mozaiek T2",null,"02",2]
[2133004,"Kl.Kan.Melanine isabelpastel geelivoor mozaiek T2",null,"02",2]
[2135001,"Kl.Kan.Melanine isabelpastel rood mozaiek T1",null,"02",2]
[2135002,"Kl.Kan.Melanine isabelpastel roodivoor mozaiek T1",null,"02",2]
[2137001,"Kl.Kan.Melanine isabelpastel rood mozaiek T2",null,"02",2]
[2137002,"Kl.Kan.Melanine isabelpastel roodivoor mozaiek T2",null,"02",2]
[2139001,"Kl.Kan.Melanine zwart grijsvleugel wit dominant",null,"02",2]
[2140001,"Kl.Kan.Melanine zwart grijsvleugel wit",null,"02",2]
[2141001,"Kl.Kan.Melanine zwart grijsvleugel geel intensief",null,"02",2]
[2141002,"Kl.Kan.Melanine zwart grijsvleugel geelivoor intensief",null,"02",2]
[2142001,"Kl.Kan.Melanine zwart grijsvleugel geel schimmel",null,"02",2]
[2142002,"Kl.Kan.Melanine zwart grijsvleugel geelivoor schimmel",null,"02",2]
[2143001,"Kl.Kan.Melanine zwart grijsvleugel rood intensief",null,"02",2]
[2143002,"Kl.Kan.Melanine zwart grijsvleugel roodivoor intensief",null,"02",2]
[2144001,"Kl.Kan.Melanine zwart grijsvleugel rood schimmel",null,"02",2]
[2144002,"Kl.Kan.Melanine zwart grijsvleugel roodivoor schimmel",null,"02",2]
[2145001,"Kl.Kan.Melanine zwart grijsvleugel geel mozaiek T2",null,"02",2]
[2145002,"Kl.Kan.Melanine zwart grijsvleugel geelivoor mozaiek T2",null,"02",2]
[2146001,"Kl.Kan.Melanine zwart grijsvleugel rood mozaiek T1",null,"02",2]
[2146002,"Kl.Kan.Melanine zwart grijsvleugel roodivoor mozaiek T1",null,"02",2]
[2147001,"Kl.Kan.Melanine zwart grijsvleugel rood mozaiek T2",null,"02",2]
[2147002,"Kl.Kan.Melanine zwart grijsvleugel roodivoor mozaiek T2",null,"02",2]
[2148001,"Kl.Kan.Melanine zwart grijsvleugel rood mozaiek T2",null,"02",2]
[2148002,"Kl.Kan.Melanine zwart grijsvleugel roodivoor mozaiek T2",null,"02",2]
[2149001,"Kl.Kan.Melanine zwartjaspis wit dominant",null,"02",2]
[2150001,"Kl.Kan.Melanine zwartjaspis wit",null,"02",2]
[2151001,"Kl.Kan.Melanine zwartjaspis geel intensief",null,"02",2]
[2151002,"Kl.Kan.Melanine zwartjaspis geelivoor intensief",null,"02",2]
[2152001,"Kl.Kan.Melanine zwartjaspis geel schimmel",null,"02",2]
[2152002,"Kl.Kan.Melanine zwartjaspis geelivoor schimmel",null,"02",2]
[2155001,"Kl.Kan.Melanine zwartjaspis rood intensief",null,"02",2]
[2155002,"Kl.Kan.Melanine zwartjaspis roodivoor intensief",null,"02",2]
[2156001,"Kl.Kan.Melanine zwartjaspis rood schimmel",null,"02",2]
[2156002,"Kl.Kan.Melanine zwartjaspis roodivoor schimmel",null,"02",2]
[2157001,"Kl.Kan.Melanine zwartjaspis geel mozaiek T1",null,"02",2]
[2157002,"Kl.Kan.Melanine zwartjaspis geelivoor mozaiek T1",null,"02",2]
[2158001,"Kl.Kan.Melanine zwartjaspis geel mozaiek T2",null,"02",2]
[2158002,"Kl.Kan.Melanine zwartjaspis geelivoor mozaiek T2",null,"02",2]
[2161001,"Kl.Kan.Melanine zwartjaspis rood mozaiek T1",null,"02",2]
[2161002,"Kl.Kan.Melanine zwartjaspis roodivoor mozaiek T1",null,"02",2]
[2162001,"Kl.Kan.Melanine zwartjaspis rood mozaiek T2",null,"02",2]
[2162002,"Kl.Kan.Melanine zwartjaspis roodivoor mozaiek T2",null,"02",2]
[2165001,"Kl.Kan.Melanine bruinjaspis wit dominant",null,"02",2]
[2166001,"Kl.Kan.Melanine bruinjaspis wit",null,"02",2]
[2167001,"Kl.Kan.Melanine bruinjaspis geel intensief",null,"02",2]
[2167002,"Kl.Kan.Melanine bruinjaspis geelivoor intensief",null,"02",2]
[2168001,"Kl.Kan.Melanine bruinjaspis geel schimmel",null,"02",2]
[2168002,"Kl.Kan.Melanine bruinjaspis geelivoor schimmel",null,"02",2]
[2169001,"Kl.Kan.Melanine bruinjaspis rood intensief",null,"02",2]
[2169002,"Kl.Kan.Melanine bruinjaspis roodivoor intensief",null,"02",2]
[2170001,"Kl.Kan.Melanine bruinjaspis rood schimmel",null,"02",2]
[2170002,"Kl.Kan.Melanine bruinjaspis roodivoor schimmel",null,"02",2]
[2171001,"Kl.Kan.Melanine bruinjaspis geel mozaiek T1",null,"02",2]
[2171002,"Kl.Kan.Melanine bruinjaspis geelivoor mozaiek T1",null,"02",2]
[2172001,"Kl.Kan.Melanine bruinjaspis geel mozaiek T2",null,"02",2]
[2172002,"Kl.Kan.Melanine bruinjaspis geelivoor mozaiek T2",null,"02",2]
[2175001,"Kl.Kan.Melanine bruinjaspis rood mozaiek T1",null,"02",2]
[2175002,"Kl.Kan.Melanine bruinjaspis roodivoor mozaiek T1",null,"02",2]
[2176001,"Kl.Kan.Melanine bruinjaspis rood mozaiek T2",null,"02",2]
[2176002,"Kl.Kan.Melanine bruinjaspis roodivoor mozaiek T2",null,"02",2]
[2177001,"Kl.Kan.Melanine agaatjaspis wit dominant",null,"02",2]
[2178001,"Kl.Kan.Melanine agaatjaspis wit",null,"02",2]
[2179001,"Kl.Kan.Melanine agaatjaspis geel intensief",null,"02",2]
[2179002,"Kl.Kan.Melanine agaatjaspis geelivoor intensief",null,"02",2]
[2180001,"Kl.Kan.Melanine agaatjaspis geel schimmel",null,"02",2]
[2180002,"Kl.Kan.Melanine agaatjaspis geelivoor schimmel",null,"02",2]
[2181001,"Kl.Kan.Melanine agaatjaspis rood intensief",null,"02",2]
[2181002,"Kl.Kan.Melanine agaatjaspis roodivoor intensief",null,"02",2]
[2182001,"Kl.Kan.Melanine agaatjaspis rood schimmel",null,"02",2]
[2182002,"Kl.Kan.Melanine agaatjaspis roodivoor schimmel",null,"02",2]
[2183001,"Kl.Kan.Melanine agaatjaspis geel mozaiek T1",null,"02",2]
[2183002,"Kl.Kan.Melanine agaatjaspis geelivoor mozaiek T1",null,"02",2]
[2184001,"Kl.Kan.Melanine agaatjaspis geel mozaiek T2",null,"02",2]
[2184002,"Kl.Kan.Melanine agaatjaspis geelivoor mozaiek T2",null,"02",2]
[2185001,"Kl.Kan.Melanine agaatjaspis rood mozaiek T1",null,"02",2]
[2185002,"Kl.Kan.Melanine agaatjaspis roodivoor mozaiek T1",null,"02",2]
[2186001,"Kl.Kan.Melanine agaatjaspis rood mozaiek T2",null,"02",2]
[2186002,"Kl.Kan.Melanine agaatjaspis roodivoor mozaiek T2",null,"02",2]
[2187001,"Kl.Kan.Melanine isabeljaspis wit dominant",null,"02",2]
[2188001,"Kl.Kan.Melanine isabeljaspis wit",null,"02",2]
[2189001,"Kl.Kan.Melanine isabeljaspis geel intensief",null,"02",2]
[2189002,"Kl.Kan.Melanine isabeljaspis geelivoor intensief",null,"02",2]
[2190001,"Kl.Kan.Melanine isabeljaspis geel schimmel",null,"02",2]
[2190002,"Kl.Kan.Melanine isabeljaspis geelivoor schimmel",null,"02",2]
[2191001,"Kl.Kan.Melanine isabeljaspis rood intensief",null,"02",2]
[2191002,"Kl.Kan.Melanine isabeljaspis roodivoor intensief",null,"02",2]
[2192001,"Kl.Kan.Melanine isabeljaspis rood schimmel",null,"02",2]
[2192002,"Kl.Kan.Melanine isabeljaspis roodivoor schimmel",null,"02",2]
[2193001,"Kl.Kan.Melanine isabeljaspis geel mozaiek T1",null,"02",2]
[2193002,"Kl.Kan.Melanine isabeljaspis geelivoor mozaiek T1",null,"02",2]
[2194001,"Kl.Kan.Melanine isabeljaspis geel mozaiek T2",null,"02",2]
[2194002,"Kl.Kan.Melanine isabeljaspis geelivoor mozaiek T2",null,"02",2]
[2195001,"Kl.Kan.Melanine isabeljaspis rood mozaiek T1",null,"02",2]
[2195002,"Kl.Kan.Melanine isabeljaspis roodivoor mozaiek T1",null,"02",2]
[2196001,"Kl.Kan.Melanine isabeljaspis rood mozaiek T2",null,"02",2]
[2196002,"Kl.Kan.Melanine isabeljaspis roodivoor mozaiek T2",null,"02",2]
[2197001,"Kl.Kan.Melanine zwartopaal wit dominant",null,"02",2]
[2198001,"Kl.Kan.Melanine zwartopaal wit",null,"02",2]
[2199001,"Kl.Kan.Melanine zwartopaal geel intensief",null,"02",2]
[2199002,"Kl.Kan.Melanine zwartopaal geelivoor intensief",null,"02",2]
[2200001,"Kl.Kan.Melanine zwartopaal geel schimmel",null,"02",2]
[2200002,"Kl.Kan.Melanine zwartopaal geelivoor schimmel",null,"02",2]
[2201001,"Kl.Kan.Melanine zwartopaal rood intensief",null,"02",2]
[2201002,"Kl.Kan.Melanine zwartopaal roodivoor intensief",null,"02",2]
[2202001,"Kl.Kan.Melanine zwartopaal rood schimmel",null,"02",2]
[2202002,"Kl.Kan.Melanine zwartopaal roodivoor schimmel",null,"02",2]
[2203001,"Kl.Kan.Melanine zwartopaal geel mozaiek T1",null,"02",2]
[2203002,"Kl.Kan.Melanine zwartopaal geelivoor mozaiek T1",null,"02",2]
[2204001,"Kl.Kan.Melanine zwartopaal geel mozaiek T2",null,"02",2]
[2204002,"Kl.Kan.Melanine zwartopaal geelivoor mozaiek T2",null,"02",2]
[2205001,"Kl.Kan.Melanine zwartopaal rood mozaiek T1",null,"02",2]
[2205002,"Kl.Kan.Melanine zwartopaal roodivoor mozaiek T1",null,"02",2]
[2206001,"Kl.Kan.Melanine zwartopaal rood mozaiek T2",null,"02",2]
[2206002,"Kl.Kan.Melanine zwartopaal roodivoor mozaiek T2",null,"02",2]
[2207001,"Kl.Kan.Melanine bruinopaal wit dominant",null,"02",2]
[2208001,"Kl.Kan.Melanine bruinopaal wit",null,"02",2]
[2209001,"Kl.Kan.Melanine bruinopaal geel intensief",null,"02",2]
[2209002,"Kl.Kan.Melanine bruinopaal geelivoor intensief",null,"02",2]
[2210001,"Kl.Kan.Melanine bruinopaal geel schimmel",null,"02",2]
[2210002,"Kl.Kan.Melanine bruinopaal geelivoor schimmel",null,"02",2]
[2211001,"Kl.Kan.Melanine bruinopaal rood intensief",null,"02",2]
[2211002,"Kl.Kan.Melanine bruinopaal roodivoor intensief",null,"02",2]
[2212001,"Kl.Kan.Melanine bruinopaal rood schimmel",null,"02",2]
[2212002,"Kl.Kan.Melanine bruinopaal roodivoor schimmel",null,"02",2]
[2213001,"Kl.Kan.Melanine bruinopaal geel mozaiek T1",null,"02",2]
[2213002,"Kl.Kan.Melanine bruinopaal geelivoor mozaiek T1",null,"02",2]
[2214001,"Kl.Kan.Melanine bruinopaal geel mozaiek T2",null,"02",2]
[2214002,"Kl.Kan.Melanine bruinopaal geelivoor mozaiek T2",null,"02",2]
[2217001,"Kl.Kan.Melanine bruinopaal rood mozaiek T1",null,"02",2]
[2217002,"Kl.Kan.Melanine bruinopaal roodivoor mozaiek T1",null,"02",2]
[2218001,"Kl.Kan.Melanine bruinopaal rood mozaiek T2",null,"02",2]
[2218002,"Kl.Kan.Melanine bruinopaal roodivoor mozaiek T2",null,"02",2]
[2221001,"Kl.Kan.Melanine agaatopaal wit dominant",null,"02",2]
[2222001,"Kl.Kan.Melanine agaatopaal wit",null,"02",2]
[2223001,"Kl.Kan.Melanine agaatopaal geel intensief",null,"02",2]
[2223002,"Kl.Kan.Melanine agaatopaal geelivoor intensief",null,"02",2]
[2224001,"Kl.Kan.Melanine agaatopaal geel schimmel",null,"02",2]
[2224002,"Kl.Kan.Melanine agaatopaal geelivoor schimmel",null,"02",2]
[2225001,"Kl.Kan.Melanine agaatopaal rood intensief",null,"02",2]
[2225002,"Kl.Kan.Melanine agaatopaal roodivoor intensief",null,"02",2]
[2226001,"Kl.Kan.Melanine agaatopaal rood schimmel",null,"02",2]
[2226002,"Kl.Kan.Melanine agaatopaal roodivoor schimmel",null,"02",2]
[2227001,"Kl.Kan.Melanine agaatopaal geel mozaiek T1",null,"02",2]
[2227002,"Kl.Kan.Melanine agaatopaal geelivoor mozaiek T1",null,"02",2]
[2229001,"Kl.Kan.Melanine agaatopaal geel mozaiek T2",null,"02",2]
[2229002,"Kl.Kan.Melanine agaatopaal geelivoor mozaiek T2",null,"02",2]
[2231001,"Kl.Kan.Melanine agaatopaal rood mozaiek T1",null,"02",2]
[2231002,"Kl.Kan.Melanine agaatopaal roodivoor mozaiek T1",null,"02",2]
[2233001,"Kl.Kan.Melanine agaatopaal rood mozaiek T2",null,"02",2]
[2233002,"Kl.Kan.Melanine agaatopaal roodivoor mozaiek T2",null,"02",2]
[2235001,"Kl.Kan.Melanine isabelopaal wit dominant",null,"02",2]
[2236001,"Kl.Kan.Melanine isabelopaal wit",null,"02",2]
[2237001,"Kl.Kan.Melanine isabelopaal geel intensief",null,"02",2]
[2237002,"Kl.Kan.Melanine isabelopaal geelivoor intensief",null,"02",2]
[2238001,"Kl.Kan.Melanine isabelopaal geel schimmel",null,"02",2]
[2238002,"Kl.Kan.Melanine isabelopaal geelivoor schimmel",null,"02",2]
[2239001,"Kl.Kan.Melanine isabelopaal rood intensief",null,"02",2]
[2239002,"Kl.Kan.Melanine isabelopaal roodivoor intensief",null,"02",2]
[2240001,"Kl.Kan.Melanine isabelopaal rood schimmel",null,"02",2]
[2240002,"Kl.Kan.Melanine isabelopaal roodivoor schimmel",null,"02",2]
[2241001,"Kl.Kan.Melanine isabelopaal geel mozaiek T1",null,"02",2]
[2241002,"Kl.Kan.Melanine isabelopaal geelivoor mozaiek T1",null,"02",2]
[2242001,"Kl.Kan.Melanine isabelopaal geel mozaiek T2",null,"02",2]
[2242002,"Kl.Kan.Melanine isabelopaal geelivoor mozaiek T2",null,"02",2]
[2245001,"Kl.Kan.Melanine isabelopaal rood mozaiek T1",null,"02",2]
[2245002,"Kl.Kan.Melanine isabelopaal roodivoor mozaiek T1",null,"02",2]
[2246001,"Kl.Kan.Melanine isabelopaal rood mozaiek T2",null,"02",2]
[2246002,"Kl.Kan.Melanine isabelopaal roodivoor mozaiek T2",null,"02",2]
[2249001,"Kl.Kan.Melanine zwartmogno wit dominant",null,"02",2]
[2250001,"Kl.Kan.Melanine zwartmogno wit",null,"02",2]
[2251001,"Kl.Kan.Melanine zwartmogno geel intensief",null,"02",2]
[2251002,"Kl.Kan.Melanine zwartmogno geelivoor intensief",null,"02",2]
[2252001,"Kl.Kan.Melanine zwartmogno geel schimmel",null,"02",2]
[2252002,"Kl.Kan.Melanine zwartmogno geelivoor schimmel",null,"02",2]
[2253001,"Kl.Kan.Melanine zwartmogno rood intensief",null,"02",2]
[2253002,"Kl.Kan.Melanine zwartmogno roodivoor intensief",null,"02",2]
[2254001,"Kl.Kan.Melanine zwartmogno rood schimmel",null,"02",2]
[2254002,"Kl.Kan.Melanine zwartmogno roodivoor schimmel",null,"02",2]
[2255001,"Kl.Kan.Melanine zwartmogno geel mozaiek T1",null,"02",2]
[2255002,"Kl.Kan.Melanine zwartmogno geelivoor mozaiek T1",null,"02",2]
[2256001,"Kl.Kan.Melanine zwartmogno geel mozaiek T2",null,"02",2]
[2256002,"Kl.Kan.Melanine zwartmogno geelivoor mozaiek T2",null,"02",2]
[2259001,"Kl.Kan.Melanine zwartmogno rood mozaiek T1",null,"02",2]
[2259002,"Kl.Kan.Melanine zwartmogno roodivoor mozaiek T1",null,"02",2]
[2260001,"Kl.Kan.Melanine zwartmogno rood mozaiek T2",null,"02",2]
[2260002,"Kl.Kan.Melanine zwartmogno roodivoor mozaiek T2",null,"02",2]
[2263001,"Kl.Kan.Melanine bruinmogno wit dominant",null,"02",2]
[2264001,"Kl.Kan.Melanine bruinmogno wit",null,"02",2]
[2265001,"Kl.Kan.Melanine bruinmogno geel intensief",null,"02",2]
[2265002,"Kl.Kan.Melanine bruinmogno geelivoor intensief",null,"02",2]
[2266001,"Kl.Kan.Melanine bruinmogno geel schimmel",null,"02",2]
[2266002,"Kl.Kan.Melanine bruinmogno geelivoor schimmel",null,"02",2]
[2267001,"Kl.Kan.Melanine bruinmogno rood intensief",null,"02",2]
[2267002,"Kl.Kan.Melanine bruinmogno roodivoor intensief",null,"02",2]
[2268001,"Kl.Kan.Melanine bruinmogno rood schimmel",null,"02",2]
[2268002,"Kl.Kan.Melanine bruinmogno roodivoor schimmel",null,"02",2]
[2269001,"Kl.Kan.Melanine bruinmogno geel mozaiek T1",null,"02",2]
[2269002,"Kl.Kan.Melanine bruinmogno geelivoor mozaiek T1",null,"02",2]
[2270001,"Kl.Kan.Melanine bruinmogno geel mozaiek T2",null,"02",2]
[2270002,"Kl.Kan.Melanine bruinmogno geelivoor mozaiek T2",null,"02",2]
[2273001,"Kl.Kan.Melanine bruinmogno rood mozaiek T1",null,"02",2]
[2273002,"Kl.Kan.Melanine bruinmogno roodivoor mozaiek T1",null,"02",2]
[2274001,"Kl.Kan.Melanine bruinmogno rood mozaiek T2",null,"02",2]
[2274002,"Kl.Kan.Melanine bruinmogno roodivoor mozaiek T2",null,"02",2]
[2277001,"Kl.Kan.Melanine phaeo wit dominant",null,"02",2]
[2278001,"Kl.Kan.Melanine phaeo wit",null,"02",2]
[2279001,"Kl.Kan.Melanine phaeo geel intensief",null,"02",2]
[2279002,"Kl.Kan.Melanine phaeo geelivoor intensief",null,"02",2]
[2280001,"Kl.Kan.Melanine phaeo geel schimmel",null,"02",2]
[2280002,"Kl.Kan.Melanine phaeo geelivoor schimmel",null,"02",2]
[2281001,"Kl.Kan.Melanine phaeo rood intensief",null,"02",2]
[2281002,"Kl.Kan.Melanine phaeo roodivoor intensief",null,"02",2]
[2282001,"Kl.Kan.Melanine phaeo rood schimmel",null,"02",2]
[2282002,"Kl.Kan.Melanine phaeo roodivoor schimmel",null,"02",2]
[2283001,"Kl.Kan.Melanine phaeo geel mozaiek T1",null,"02",2]
[2283002,"Kl.Kan.Melanine phaeo geelivoor mozaiek T1",null,"02",2]
[2284001,"Kl.Kan.Melanine phaeo geel mozaiek T2",null,"02",2]
[2284002,"Kl.Kan.Melanine phaeo geelivoor mozaiek T2",null,"02",2]
[2285001,"Kl.Kan.Melanine phaeo rood mozaiek T1",null,"02",2]
[2285002,"Kl.Kan.Melanine phaeo roodivoor mozaiek T1",null,"02",2]
[2287001,"Kl.Kan.Melanine phaeo rood mozaiek T2",null,"02",2]
[2287002,"Kl.Kan.Melanine phaeo roodivoor mozaiek T2",null,"02",2]
[2289001,"Kl.Kan.Melanine satinet wit dominant",null,"02",2]
[2290001,"Kl.Kan.Melanine satinet wit",null,"02",2]
[2291001,"Kl.Kan.Melanine satinet geel intensief",null,"02",2]
[2291002,"Kl.Kan.Melanine satinet geelivoor intensief",null,"02",2]
[2292001,"Kl.Kan.Melanine satinet geel schimmel",null,"02",2]
[2292002,"Kl.Kan.Melanine satinet geelivoor schimmel",null,"02",2]
[2293001,"Kl.Kan.Melanine satinet rood intensief",null,"02",2]
[2293002,"Kl.Kan.Melanine satinet roodivoor intensief",null,"02",2]
[2294001,"Kl.Kan.Melanine satinet rood schimmel",null,"02",2]
[2294002,"Kl.Kan.Melanine satinet roodivoor schimmel",null,"02",2]
[2295001,"Kl.Kan.Melanine satinet geel mozaiek T1",null,"02",2]
[2295002,"Kl.Kan.Melanine satinet geelivoor mozaiek T1",null,"02",2]
[2297001,"Kl.Kan.Melanine satinet geel mozaiek T2",null,"02",2]
[2297002,"Kl.Kan.Melanine satinet geelivoor mozaiek T2",null,"02",2]
[2299001,"Kl.Kan.Melanine satinet rood mozaiek T1",null,"02",2]
[2299002,"Kl.Kan.Melanine satinet roodivoor mozaiek T1",null,"02",2]
[2301001,"Kl.Kan.Melanine satinet rood mozaiek T2",null,"02",2]
[2301002,"Kl.Kan.Melanine satinet roodivoor mozaiek T2",null,"02",2]
[2303001,"Kl.Kan.Melanine zwarttopaas wit dominant",null,"02",2]
[2304001,"Kl.Kan.Melanine zwarttopaas wit",null,"02",2]
[2305001,"Kl.Kan.Melanine zwarttopaas geel intensief",null,"02",2]
[2305002,"Kl.Kan.Melanine zwarttopaas geelivoor intensief",null,"02",2]
[2306001,"Kl.Kan.Melanine zwarttopaas geel schimmel",null,"02",2]
[2306002,"Kl.Kan.Melanine zwarttopaas geelivoor schimmel",null,"02",2]
[2307001,"Kl.Kan.Melanine zwarttopaas rood intensief",null,"02",2]
[2307002,"Kl.Kan.Melanine zwarttopaas roodivoor intensief",null,"02",2]
[2308001,"Kl.Kan.Melanine zwarttopaas rood schimmel",null,"02",2]
[2308002,"Kl.Kan.Melanine zwarttopaas roodivoor schimmel",null,"02",2]
[2309001,"Kl.Kan.Melanine zwarttopaas geel mozaiek T1",null,"02",2]
[2309002,"Kl.Kan.Melanine zwarttopaas geelivoor mozaiek T1",null,"02",2]
[2310001,"Kl.Kan.Melanine zwarttopaas geel mozaiek T2",null,"02",2]
[2310002,"Kl.Kan.Melanine zwarttopaas geelivoor mozaiek T2",null,"02",2]
[2313001,"Kl.Kan.Melanine zwarttopaas rood mozaiek T1",null,"02",2]
[2313002,"Kl.Kan.Melanine zwarttopaas roodivoor mozaiek T1",null,"02",2]
[2314001,"Kl.Kan.Melanine zwarttopaas rood mozaiek T2",null,"02",2]
[2314002,"Kl.Kan.Melanine zwarttopaas roodivoor mozaiek T2",null,"02",2]
[2317001,"Kl.Kan.Melanine bruintopaas wit dominant",null,"02",2]
[2318001,"Kl.Kan.Melanine bruintopaas wit",null,"02",2]
[2319001,"Kl.Kan.Melanine bruintopaas geel intensief",null,"02",2]
[2319002,"Kl.Kan.Melanine bruintopaas geelivoor intensief",null,"02",2]
[2320001,"Kl.Kan.Melanine bruintopaas geel schimmel",null,"02",2]
[2320002,"Kl.Kan.Melanine bruintopaas geelivoor schimmel",null,"02",2]
[2321001,"Kl.Kan.Melanine bruintopaas rood intensief",null,"02",2]
[2321002,"Kl.Kan.Melanine bruintopaas roodivoor intensief",null,"02",2]
[2322001,"Kl.Kan.Melanine bruintopaas rood schimmel",null,"02",2]
[2322002,"Kl.Kan.Melanine bruintopaas roodivoor schimmel",null,"02",2]
[2323001,"Kl.Kan.Melanine bruintopaas geel mozaiek T1",null,"02",2]
[2323002,"Kl.Kan.Melanine bruintopaas geelivoor mozaiek T1",null,"02",2]
[2324001,"Kl.Kan.Melanine bruintopaas geel mozaiek T2",null,"02",2]
[2324002,"Kl.Kan.Melanine bruintopaas geelivoor mozaiek T2",null,"02",2]
[2325001,"Kl.Kan.Melanine bruintopaas rood mozaiek T1",null,"02",2]
[2325002,"Kl.Kan.Melanine bruintopaas roodivoor mozaiek T1",null,"02",2]
[2326001,"Kl.Kan.Melanine bruintopaas rood mozaiek T2",null,"02",2]
[2326002,"Kl.Kan.Melanine bruintopaas roodivoor mozaiek T2",null,"02",2]
[2327001,"Kl.Kan.Melanine agaattopaas wit dominant",null,"02",2]
[2328001,"Kl.Kan.Melanine agaattopaas wit",null,"02",2]
[2331001,"Kl.Kan.Melanine agaattopaas geel intensief",null,"02",2]
[2331002,"Kl.Kan.Melanine agaattopaas geelivoor intensief",null,"02",2]
[2332001,"Kl.Kan.Melanine agaattopaas geel schimmel",null,"02",2]
[2332002,"Kl.Kan.Melanine agaattopaas geelivoor schimmel",null,"02",2]
[2333001,"Kl.Kan.Melanine agaattopaas rood intensief",null,"02",2]
[2333002,"Kl.Kan.Melanine agaattopaas roodivoor intensief",null,"02",2]
[2334001,"Kl.Kan.Melanine agaattopaas rood schimmel",null,"02",2]
[2334002,"Kl.Kan.Melanine agaattopaas roodivoor schimmel",null,"02",2]
[2335001,"Kl.Kan.Melanine agaattopaas geel mozaiek T1",null,"02",2]
[2335002,"Kl.Kan.Melanine agaattopaas geelivoor mozaiek T1",null,"02",2]
[2337001,"Kl.Kan.Melanine agaattopaas geel mozaiek T2",null,"02",2]
[2337002,"Kl.Kan.Melanine agaattopaas geelivoor mozaiek T2",null,"02",2]
[2339001,"Kl.Kan.Melanine agaattopaas rood mozaiek T1",null,"02",2]
[2339002,"Kl.Kan.Melanine agaattopaas roodivoor mozaiek T1",null,"02",2]
[2341001,"Kl.Kan.Melanine agaattopaas rood mozaiek T2",null,"02",2]
[2341002,"Kl.Kan.Melanine agaattopaas roodivoor mozaiek T2",null,"02",2]
[2343001,"Kl.Kan.Melanine isabeltopaas wit dominant",null,"02",2]
[2344001,"Kl.Kan.Melanine isabeltopaas wit",null,"02",2]
[2345001,"Kl.Kan.Melanine isabeltopaas geel intensief",null,"02",2]
[2345002,"Kl.Kan.Melanine isabeltopaas geelivoor intensief",null,"02",2]
[2346001,"Kl.Kan.Melanine isabeltopaas geel schimmel",null,"02",2]
[2346002,"Kl.Kan.Melanine isabeltopaas geelivoor schimmel",null,"02",2]
[2347001,"Kl.Kan.Melanine isabeltopaas rood intensief",null,"02",2]
[2347002,"Kl.Kan.Melanine isabeltopaas roodivoor intensief",null,"02",2]
[2348001,"Kl.Kan.Melanine isabeltopaas rood schimmel",null,"02",2]
[2348002,"Kl.Kan.Melanine isabeltopaas roodivoor schimmel",null,"02",2]
[2349001,"Kl.Kan.Melanine isabeltopaas geel mozaiek T1",null,"02",2]
[2349002,"Kl.Kan.Melanine isabeltopaas geelivoor mozaiek T1",null,"02",2]
[2350001,"Kl.Kan.Melanine isabeltopaas geel mozaiek T2",null,"02",2]
[2350002,"Kl.Kan.Melanine isabeltopaas geelivoor mozaiek T2",null,"02",2]
[2353001,"Kl.Kan.Melanine isabeltopaas rood mozaiek T1",null,"02",2]
[2353002,"Kl.Kan.Melanine isabeltopaas roodivoor mozaiek T1",null,"02",2]
[2354001,"Kl.Kan.Melanine isabeltopaas rood mozaiek T2",null,"02",2]
[2354002,"Kl.Kan.Melanine isabeltopaas roodivoor mozaiek T2",null,"02",2]
[2357001,"Kl.Kan.Melanine zwarteumo wit dominant",null,"02",2]
[2358001,"Kl.Kan.Melanine zwarteumo wit",null,"02",2]
[2359001,"Kl.Kan.Melanine zwarteumo geel intensief",null,"02",2]
[2359002,"Kl.Kan.Melanine zwarteumo geelivoor intensief",null,"02",2]
[2360001,"Kl.Kan.Melanine zwarteumo geel schimmel",null,"02",2]
[2360002,"Kl.Kan.Melanine zwarteumo geelivoor schimmel",null,"02",2]
[2361001,"Kl.Kan.Melanine zwarteumo rood intensief",null,"02",2]
[2361002,"Kl.Kan.Melanine zwarteumo roodivoor intensief",null,"02",2]
[2362001,"Kl.Kan.Melanine zwarteumo rood schimmel",null,"02",2]
[2362002,"Kl.Kan.Melanine zwarteumo roodivoor schimmel",null,"02",2]
[2363001,"Kl.Kan.Melanine zwarteumo geel mozaiek T1",null,"02",2]
[2363002,"Kl.Kan.Melanine zwarteumo geelivoor mozaiek T1",null,"02",2]
[2364001,"Kl.Kan.Melanine zwarteumo geel mozaiek T2",null,"02",2]
[2364002,"Kl.Kan.Melanine zwarteumo geelivoor mozaiek T2",null,"02",2]
[2367001,"Kl.Kan.Melanine zwarteumo rood mozaiek T1",null,"02",2]
[2367002,"Kl.Kan.Melanine zwarteumo roodivoor mozaiek T1",null,"02",2]
[2368001,"Kl.Kan.Melanine zwarteumo rood mozaiek T2",null,"02",2]
[2368002,"Kl.Kan.Melanine zwarteumo roodivoor mozaiek T2",null,"02",2]
[2371001,"Kl.Kan.Melanine bruineumo wit dominant",null,"02",2]
[2372001,"Kl.Kan.Melanine bruineumo wit",null,"02",2]
[2373001,"Kl.Kan.Melanine bruineumo geel intensief",null,"02",2]
[2373002,"Kl.Kan.Melanine bruineumo geelivoor intensief",null,"02",2]
[2374001,"Kl.Kan.Melanine bruineumo geel schimmel",null,"02",2]
[2374002,"Kl.Kan.Melanine bruineumo geelivoor schimmel",null,"02",2]
[2375001,"Kl.Kan.Melanine bruineumo rood intensief",null,"02",2]
[2375002,"Kl.Kan.Melanine bruineumo roodivoor intensief",null,"02",2]
[2376001,"Kl.Kan.Melanine bruineumo rood schimmel",null,"02",2]
[2376002,"Kl.Kan.Melanine bruineumo roodivoor schimmel",null,"02",2]
[2377001,"Kl.Kan.Melanine bruineumo geel mozaiek T1",null,"02",2]
[2377002,"Kl.Kan.Melanine bruineumo geelivoor mozaiek T1",null,"02",2]
[2378001,"Kl.Kan.Melanine bruineumo geel mozaiek T2",null,"02",2]
[2378002,"Kl.Kan.Melanine bruineumo geelivoor mozaiek T2",null,"02",2]
[2379001,"Kl.Kan.Melanine bruineumo rood mozaiek T1",null,"02",2]
[2379002,"Kl.Kan.Melanine bruineumo roodivoor mozaiek T1",null,"02",2]
[2381003,"Kl.Kan.Melanine bruineumo rood mozaiek T2",null,"02",2]
[2381004,"Kl.Kan.Melanine bruineumo roodivoor mozaiek T2",null,"02",2]
[2385001,"Kl.Kan.Melanine agaateumo wit dominant",null,"02",2]
[2386001,"Kl.Kan.Melanine agaateumo wit",null,"02",2]
[2387001,"Kl.Kan.Melanine agaateumo geel intensief",null,"02",2]
[2387002,"Kl.Kan.Melanine agaateumo geelivoor intensief",null,"02",2]
[2388001,"Kl.Kan.Melanine agaateumo geel schimmel",null,"02",2]
[2388002,"Kl.Kan.Melanine agaateumo geelivoor schimmel",null,"02",2]
[2389001,"Kl.Kan.Melanine agaateumo rood intensief",null,"02",2]
[2389002,"Kl.Kan.Melanine agaateumo roodivoor intensief",null,"02",2]
[2390001,"Kl.Kan.Melanine agaateumo rood schimmel",null,"02",2]
[2390002,"Kl.Kan.Melanine agaateumo roodivoor schimmel",null,"02",2]
[2391001,"Kl.Kan.Melanine agaateumo geel mozaiek T1",null,"02",2]
[2391002,"Kl.Kan.Melanine agaateumo geelivoor mozaiek T1",null,"02",2]
[2393001,"Kl.Kan.Melanine agaateumo geel mozaiek T2",null,"02",2]
[2393002,"Kl.Kan.Melanine agaateumo geelivoor mozaiek T2",null,"02",2]
[2395001,"Kl.Kan.Melanine agaateumo rood mozaiek T1",null,"02",2]
[2395002,"Kl.Kan.Melanine agaateumo roodivoor mozaiek T1",null,"02",2]
[2397001,"Kl.Kan.Melanine agaateumo rood mozaiek T2",null,"02",2]
[2397002,"Kl.Kan.Melanine agaateumo roodivoor mozaiek T2",null,"02",2]
[2399001,"Kl.Kan.Melanine zwartonyx wit dominant",null,"02",2]
[2400001,"Kl.Kan.Melanine zwartonyx wit",null,"02",2]
[2401001,"Kl.Kan.Melanine zwartonyx geel intensief",null,"02",2]
[2401002,"Kl.Kan.Melanine zwartonyx geelivoor intensief",null,"02",2]
[2402001,"Kl.Kan.Melanine zwartonyx geel schimmel",null,"02",2]
[2402002,"Kl.Kan.Melanine zwartonyx geelivoor schimmel",null,"02",2]
[2403001,"Kl.Kan.Melanine zwartonyx rood intensief",null,"02",2]
[2403002,"Kl.Kan.Melanine zwartonyx roodivoor intensief",null,"02",2]
[2404001,"Kl.Kan.Melanine zwartonyx rood schimmel",null,"02",2]
[2404002,"Kl.Kan.Melanine zwartonyx roodivoor schimmel",null,"02",2]
[2405001,"Kl.Kan.Melanine zwartonyx geel mozaiek T1",null,"02",2]
[2405002,"Kl.Kan.Melanine zwartonyx geelivoor mozaiek T1",null,"02",2]
[2406001,"Kl.Kan.Melanine zwartonyx geel mozaiek T2",null,"02",2]
[2406002,"Kl.Kan.Melanine zwartonyx geelivoor mozaiek T2",null,"02",2]
[2409001,"Kl.Kan.Melanine zwartonyx rood mozaiek T1",null,"02",2]
[2409002,"Kl.Kan.Melanine zwartonyx roodivoor mozaiek T1",null,"02",2]
[2410001,"Kl.Kan.Melanine zwartonyx rood mozaiek T2",null,"02",2]
[2410002,"Kl.Kan.Melanine zwartonyx roodivoor mozaiek T2",null,"02",2]
[2413001,"Kl.Kan.Melanine bruinonyx wit dominant",null,"02",2]
[2414001,"Kl.Kan.Melanine bruinonyx wit",null,"02",2]
[2415001,"Kl.Kan.Melanine bruinonyx geel intensief",null,"02",2]
[2415002,"Kl.Kan.Melanine bruinonyx geelivoor intensief",null,"02",2]
[2416001,"Kl.Kan.Melanine bruinonyx geel schimmel",null,"02",2]
[2416002,"Kl.Kan.Melanine bruinonyx geelivoor schimmel",null,"02",2]
[2417001,"Kl.Kan.Melanine bruinonyx rood intensief",null,"02",2]
[2417002,"Kl.Kan.Melanine bruinonyx roodivoor intensief",null,"02",2]
[2418001,"Kl.Kan.Melanine bruinonyx rood schimmel",null,"02",2]
[2418002,"Kl.Kan.Melanine bruinonyx roodivoor schimmel",null,"02",2]
[2419001,"Kl.Kan.Melanine bruinonyx geel mozaiek T1",null,"02",2]
[2419002,"Kl.Kan.Melanine bruinonyx geelivoor mozaiek T1",null,"02",2]
[2420001,"Kl.Kan.Melanine bruinonyx geel mozaiek T2",null,"02",2]
[2420002,"Kl.Kan.Melanine bruinonyx geelivoor mozaiek T2",null,"02",2]
[2423001,"Kl.Kan.Melanine bruinonyx rood mozaiek T1",null,"02",2]
[2423002,"Kl.Kan.Melanine bruinonyx roodivoor mozaiek T1",null,"02",2]
[2424001,"Kl.Kan.Melanine bruinonyx rood mozaiek T2",null,"02",2]
[2424002,"Kl.Kan.Melanine bruinonyx roodivoor mozaiek T2",null,"02",2]
[2427001,"Kl.Kan.Melanine agaatonyx wit dominant",null,"02",2]
[2428001,"Kl.Kan.Melanine agaatonyx wit",null,"02",2]
[2429001,"Kl.Kan.Melanine agaatonyx geel intensief",null,"02",2]
[2429002,"Kl.Kan.Melanine agaatonyx geelivoor intensief",null,"02",2]
[2430001,"Kl.Kan.Melanine agaatonyx geel schimmel",null,"02",2]
[2430002,"Kl.Kan.Melanine agaatonyx geelivoor schimmel",null,"02",2]
[2431001,"Kl.Kan.Melanine agaatonyx rood intensief",null,"02",2]
[2431002,"Kl.Kan.Melanine agaatonyx roodivoor intensief",null,"02",2]
[2432001,"Kl.Kan.Melanine agaatonyx rood schimmel",null,"02",2]
[2432002,"Kl.Kan.Melanine agaatonyx roodivoor schimmel",null,"02",2]
[2433001,"Kl.Kan.Melanine agaatonyx geel mozaiek T1",null,"02",2]
[2433002,"Kl.Kan.Melanine agaatonyx geelivoor mozaiek T1",null,"02",2]
[2434001,"Kl.Kan.Melanine agaatonyx geel mozaiek T2",null,"02",2]
[2434002,"Kl.Kan.Melanine agaatonyx geelivoor mozaiek T2",null,"02",2]
[2447001,"Kl.Kan.Melanine agaatonyx rood mozaiek T1",null,"02",2]
[2447002,"Kl.Kan.Melanine agaatonyx roodivoor mozaiek T1",null,"02",2]
[2448001,"Kl.Kan.Melanine agaatonyx rood mozaiek T2",null,"02",2]
[2448002,"Kl.Kan.Melanine agaatonyx roodivoor mozaiek T2",null,"02",2]
[2453001,"Kl.Kan.Melanine zwartkobalt wit dominant",null,"02",2]
[2454001,"Kl.Kan.Melanine zwartkobalt wit",null,"02",2]
[2455001,"Kl.Kan.Melanine zwartkobalt geel intensief",null,"02",2]
[2455002,"Kl.Kan.Melanine zwartkobalt geelivoor intensief",null,"02",2]
[2456001,"Kl.Kan.Melanine zwartkobalt geel schimmel",null,"02",2]
[2456002,"Kl.Kan.Melanine zwartkobalt geelivoor schimmel",null,"02",2]
[2457001,"Kl.Kan.Melanine zwartkobalt rood intensief",null,"02",2]
[2457002,"Kl.Kan.Melanine zwartkobalt roodivoor intensief",null,"02",2]
[2458001,"Kl.Kan.Melanine zwartkobalt rood schimmel",null,"02",2]
[2458002,"Kl.Kan.Melanine zwartkobalt roodivoor schimmel",null,"02",2]
[2459001,"Kl.Kan.Melanine zwartkobalt geel mozaiek T1",null,"02",2]
[2459002,"Kl.Kan.Melanine zwartkobalt geelivoor mozaiek T1",null,"02",2]
[2460001,"Kl.Kan.Melanine zwartkobalt geel mozaiek T2",null,"02",2]
[2460002,"Kl.Kan.Melanine zwartkobalt geelivoor mozaiek T2",null,"02",2]
[2462001,"Kl.Kan.Melanine zwartkobalt rood mozaiek T1",null,"02",2]
[2462002,"Kl.Kan.Melanine zwartkobalt roodivoor mozaiek T1",null,"02",2]
[2463001,"Kl.Kan.Melanine zwartkobalt rood mozaiek T2",null,"02",2]
[2463002,"Kl.Kan.Melanine zwartkobalt roodivoor mozaiek T2",null,"02",2]
[2477001,"Kl.Kan.Melanine bruinkobalt wit dominant",null,"02",2]
[2478001,"Kl.Kan.Melanine bruinkobalt wit",null,"02",2]
[2479001,"Kl.Kan.Melanine bruinkobalt geel intensief",null,"02",2]
[2479002,"Kl.Kan.Melanine bruinkobalt geelivoor intensief",null,"02",2]
[2480001,"Kl.Kan.Melanine bruinkobalt geel schimmel",null,"02",2]
[2480002,"Kl.Kan.Melanine bruinkobalt geelivoor schimmel",null,"02",2]
[2481001,"Kl.Kan.Melanine bruinkobalt rood intensief",null,"02",2]
[2481002,"Kl.Kan.Melanine bruinkobalt roodivoor intensief",null,"02",2]
[2482001,"Kl.Kan.Melanine bruinkobalt rood schimmel",null,"02",2]
[2482002,"Kl.Kan.Melanine bruinkobalt roodivoor schimmel",null,"02",2]
[2483001,"Kl.Kan.Melanine bruinkobalt geel mozaiek T1",null,"02",2]
[2483002,"Kl.Kan.Melanine bruinkobalt geelivoor mozaiek T1",null,"02",2]
[2484001,"Kl.Kan.Melanine bruinkobalt geel mozaiek T2",null,"02",2]
[2484002,"Kl.Kan.Melanine bruinkobalt geelivoor mozaiek T2",null,"02",2]
[2487001,"Kl.Kan.Melanine bruinkobalt rood mozaiek T1",null,"02",2]
[2487002,"Kl.Kan.Melanine bruinkobalt roodivoor mozaiek T1",null,"02",2]
[2488001,"Kl.Kan.Melanine bruinkobalt rood mozaiek T2",null,"02",2]
[2488002,"Kl.Kan.Melanine bruinkobalt roodivoor mozaiek T2",null,"02",2]
[2491001,"Kl.Kan.Melanine agaatkobalt wit dominant",null,"02",2]
[2492001,"Kl.Kan.Melanine agaatkobalt wit",null,"02",2]
[2493001,"Kl.Kan.Melanine agaatkobalt geel intensief",null,"02",2]
[2493002,"Kl.Kan.Melanine agaatkobalt geelivoor intensief",null,"02",2]
[2494001,"Kl.Kan.Melanine agaatkobalt geel schimmel",null,"02",2]
[2494002,"Kl.Kan.Melanine agaatkobalt geelivoor schimmel",null,"02",2]
[2495001,"Kl.Kan.Melanine agaatkobalt rood intensief",null,"02",2]
[2495002,"Kl.Kan.Melanine agaatkobalt roodivoor intensief",null,"02",2]
[2496001,"Kl.Kan.Melanine agaatkobalt rood schimmel",null,"02",2]
[2496002,"Kl.Kan.Melanine agaatkobalt roodivoor schimmel",null,"02",2]
[2497001,"Kl.Kan.Melanine agaatkobalt geel mozaiek T1",null,"02",2]
[2497002,"Kl.Kan.Melanine agaatkobalt geelivoor mozaiek T1",null,"02",2]
[2498001,"Kl.Kan.Melanine agaatkobalt geel mozaiek T2",null,"02",2]
[2498002,"Kl.Kan.Melanine agaatkobalt geelivoor mozaiek T2",null,"02",2]
[2501001,"Kl.Kan.Melanine agaatkobalt rood mozaiek T1",null,"02",2]
[2501002,"Kl.Kan.Melanine agaatkobalt roodivoor mozaiek T1",null,"02",2]
[2502001,"Kl.Kan.Melanine agaatkobalt rood mozaiek T2",null,"02",2]
[2502002,"Kl.Kan.Melanine agaatkobalt roodivoor mozaiek T2",null,"02",2]
[2505001,"Kl.Kan.Melanine isabelkobalt wit dominant",null,"02",2]
[2506001,"Kl.Kan.Melanine isabelkobalt wit",null,"02",2]
[2507001,"Kl.Kan.Melanine isabelkobalt geel intensief",null,"02",2]
[2507002,"Kl.Kan.Melanine isabelkobalt geelivoor intensief",null,"02",2]
[2508001,"Kl.Kan.Melanine isabelkobalt geel schimmel",null,"02",2]
[2508002,"Kl.Kan.Melanine isabelkobalt geelivoor schimmel",null,"02",2]
[2509001,"Kl.Kan.Melanine isabelkobalt rood intensief",null,"02",2]
[2509002,"Kl.Kan.Melanine isabelkobalt roodivoor intensief",null,"02",2]
[2510001,"Kl.Kan.Melanine isabelkobalt rood schimmel",null,"02",2]
[2510002,"Kl.Kan.Melanine isabelkobalt roodivoor schimmel",null,"02",2]
[2511001,"Kl.Kan.Melanine isabelkobalt geel mozaiek T1",null,"02",2]
[2511002,"Kl.Kan.Melanine isabelkobalt geelivoor mozaiek T1",null,"02",2]
[2512001,"Kl.Kan.Melanine isabelkobalt geel mozaiek T2",null,"02",2]
[2512002,"Kl.Kan.Melanine isabelkobalt geelivoor mozaiek T2",null,"02",2]
[2515001,"Kl.Kan.Melanine isabelkobalt rood mozaiek T1",null,"02",2]
[2515002,"Kl.Kan.Melanine isabelkobalt roodivoor mozaiek T1",null,"02",2]
[2516001,"Kl.Kan.Melanine isabelkobalt rood mozaiek T2",null,"02",2]
[2516002,"Kl.Kan.Melanine isabelkobalt roodivoor mozaiek T2",null,"02",2]
[2601001,"Kl.Kan.Melanine Satimax wit dominant",null,"02",2]
[2602001,"Kl.Kan.Melanine Satimax wit",null,"02",2]
[2604001,"Kl.Kan.Melanine Satimax geel intensief",null,"02",2]
[2604002,"Kl.Kan.Melanine Satimax geelivoor intensief",null,"02",2]
[2605001,"Kl.Kan.Melanine Satimax geel schimmel",null,"02",2]
[2605002,"Kl.Kan.Melanine Satimax geelivoor schimmel",null,"02",2]
[2607001,"Kl.Kan.Melanine Satimax rood intensief",null,"02",2]
[2607002,"Kl.Kan.Melanine Satimax roodivoor intensief",null,"02",2]
[2608001,"Kl.Kan.Melanine Satimax rood schimmel",null,"02",2]
[2608002,"Kl.Kan.Melanine Satimax roodivoor schimmel",null,"02",2]
[2610001,"Kl.Kan.Melanine Satimax geel mozaiek T1",null,"02",2]
[2610002,"Kl.Kan.Melanine Satimax geelivoor mozaiek T1",null,"02",2]
[2611001,"Kl.Kan.Melanine Satimax geel mozaiek T2",null,"02",2]
[2611002,"Kl.Kan.Melanine Satimax geelivoor mozaiek T2",null,"02",2]
[2613001,"Kl.Kan.Melanine Satimax rood mozaiek T1",null,"02",2]
[2613002,"Kl.Kan.Melanine Satimax roodivoor mozaiek T1",null,"02",2]
[2614001,"Kl.Kan.Melanine Satimax rood mozaiek T2",null,"02",2]
[2614002,"Kl.Kan.Melanine Satimax roodivoor mozaiek T2",null,"02",2]
[2900900,"Kl.Kan.Nieuwe niet erkende mut. en comb. zwart serie",null,"02",2]
[2900999,"Kl.Kan.Nieuwe erkende mut. en comb. (in standaard) zwart serie",null,"02",2]
[2910900,"Kl.Kan.Nieuwe niet erkende mut. en comb. bruin serie",null,"02",2]
[2910999,"Kl.Kan.Nieuwe erkende mut. en comb. (in standaard) bruin serie",null,"02",2]
[2920900,"Kl.Kan.Nieuwe nog niet erkende mut. en comb. agaat serie",null,"02",2]
[2920999,"Kl.Kan.Nieuwe erkende mut. en comb. (in standaard) agaat serie",null,"02",2]
[2930900,"Kl.Kan.Nieuwe niet erkende mut. en comb. isabel serie",null,"02",2]
[2930999,"Kl.Kan.Nieuwe erkende mut. en comb. (in standaard) isabel serie",null,"02",2]
[4001001,"Post.Kan.Arriciato gigante italiano (AGI) lipochroom",null,"04",2]
[4003001,"Post.Kan.Arriciato gigante italiano (AGI) melanine",null,"04",2]
[4005001,"Post.Kan.Arriciato gigante italiano (AGI) bont",null,"04",2]
[4007001,"Post.Kan.Arriciato gigante italiano (AGI) alle witfactorigen",null,"04",2]
[4009001,"Post.Kan.Parijse frise lipochroom",null,"04",2]
[4011001,"Post.Kan.Parijse frise melanine",null,"04",2]
[4013001,"Post.Kan.Parijse frise bont",null,"04",2]
[4015001,"Post.Kan.Parijse frise alle witfactorigen",null,"04",2]
[4017001,"Post.Kan.Padovan gladkop lipochroom",null,"04",2]
[4019001,"Post.Kan.Padovan gladkop melanine",null,"04",2]
[4021001,"Post.Kan.Padovan gladkop bont",null,"04",2]
[4023001,"Post.Kan.Padovan gladkop alle witfactorigen",null,"04",2]
[4025001,"Post.Kan.Padovan gekuifd lipochroom",null,"04",2]
[4027001,"Post.Kan.Padovan gekuifd melanine",null,"04",2]
[4029001,"Post.Kan.Padovan gekuifd bont",null,"04",2]
[4031001,"Post.Kan.Padovan gekuifd alle witfactorigen",null,"04",2]
[4033001,"Post.Kan.Rasmi lipochroom",null,"04",2]
[4035001,"Post.Kan.Rasmi Melanine",null,"04",2]
[4037001,"Post.Kan.Rasmi bont",null,"04",2]
[4039001,"Post.Kan.Rasmi witfactorig",null,"04",2]
[4041001,"Post.Kan.Mehringer lipochroom",null,"03",2]
[4043001,"Post.Kan.Mehringer melanine",null,"03",2]
[4045001,"Post.Kan.Mehringer bont",null,"03",2]
[4047001,"Post.Kan.Mehringer alle witfactorigen",null,"03",2]
[4049001,"Post.Kan.Noordhollandse frise lipochroom",null,"03",2]
[4051001,"Post.Kan.Noordhollandse frise melanine",null,"03",2]
[4053001,"Post.Kan.Noordhollandse frise bont",null,"03",2]
[4055001,"Post.Kan.Noordhollandse frise alle witfactorigen",null,"03",2]
[4057001,"Post.Kan.Fiorino gladkop lipochroom",null,"03",2]
[4059001,"Post.Kan.Fiorino gladkop melanine",null,"03",2]
[4061001,"Post.Kan.Fiorino gladkop bont",null,"03",2]
[4063001,"Post.Kan.Fiorino gladkop alle witfactorigen",null,"03",2]
[4065001,"Post.Kan.Fiorino gekuifd lipochroom",null,"03",2]
[4067001,"Post.Kan.Fiorino gekuifd melanine",null,"03",2]
[4069001,"Post.Kan.Fiorino gekuifd bont",null,"03",2]
[4071001,"Post.Kan.Fiorino gekuifd alle witfactorigen",null,"03",2]
[4073001,"Post.Kan.Zwitserse frise lipochroom",null,"03",2]
[4075001,"Post.Kan.Zwitserse frise melanine",null,"03",2]
[4077001,"Post.Kan.Zwitserse frise bont",null,"03",2]
[4079001,"Post.Kan.Zwitserse frise alle witfactorigen",null,"03",2]
[4081001,"Post.Kan.Zuidhollandse frise lipochroom",null,"03",2]
[4083001,"Post.Kan.Zuidhollandse frise melanine",null,"03",2]
[4085001,"Post.Kan.Zuidhollandse frise bont",null,"03",2]
[4087001,"Post.Kan.Zuidhollandse frise alle witfactorigen",null,"03",2]
[4089001,"Post.Kan.Gibber Italicus lipochroom",null,"03",2]
[4091001,"Post.Kan.Gibber Italicus melanine",null,"03",2]
[4093001,"Post.Kan.Gibber Italicus bont",null,"03",2]
[4095001,"Post.Kan.Gibber Italicus alle witfactorigen",null,"03",2]
[4097001,"Post.Kan.Giboso Espanol lipochroom",null,"03",2]
[4099001,"Post.Kan.Giboso Espanol melanine",null,"03",2]
[4101001,"Post.Kan.Giboso Espanol bont",null,"03",2]
[4103001,"Post.Kan.Giboso Espanol alle witfactorigen",null,"03",2]
[4105001,"Post.Kan.Melado Tinerfeno lipochroom",null,"03",2]
[4107001,"Post.Kan.Melado Tinerfeno melanine",null,"03",2]
[4109001,"Post.Kan.Melado Tinerfeno bont",null,"03",2]
[4111001,"Post.Kan.Melado Tinerfeno alle witfactorigen",null,"03",2]
[4113001,"Post.Kan.Salentino wit",null,"03",2]
[4115001,"Post.Kan.Salentino rood intensief",null,"03",2]
[4117001,"Post.Kan.Salentino rood scimmel",null,"03",2]
[4119001,"Post.Kan.Rogetto lipochroom",null,"03",2]
[4121001,"Post.Kan.Rogetto melanine",null,"03",2]
[4123001,"Post.Kan.Rogetto bont",null,"03",2]
[4125001,"Post.Kan.Rogetto alle witfactorigen",null,"03",2]
[4127001,"Post.Kan.Yorkshire lipochroom intensief",null,"03",2]
[4129001,"Post.Kan.Yorkshire lipochroom schimmel",null,"03",2]
[4131001,"Post.Kan.Yorkshire melanine intensief",null,"03",2]
[4133001,"Post.Kan.Yorkshire melanine schimmel",null,"03",2]
[4135001,"Post.Kan.Yorkshire bont intensief",null,"03",2]
[4137001,"Post.Kan.Yorkshire bont schimmel",null,"03",2]
[4139001,"Post.Kan.Yorkshire alle witfactorigen",null,"03",2]
[4141001,"Post.Kan.Lancashire gladkop geel lipochroom intensief",null,"03",2]
[4143001,"Post.Kan.Lancashire gladkop geel lipochroom schimmel",null,"03",2]
[4145001,"Post.Kan.Lancashire gladkop wit",null,"03",2]
[4147001,"Post.Kan.Lancashire gekuifd geel lipochroom intensief",null,"03",2]
[4149001,"Post.Kan.Lancashire gekuifd geel lipochroom schimmel",null,"03",2]
[4151001,"Post.Kan.Lancashire gekuifd wit",null,"03",2]
[4153001,"Post.Kan.Berner lipochroom intensief",null,"03",2]
[4155001,"Post.Kan.Berner lipochroom schimmel",null,"03",2]
[4157001,"Post.Kan.Berner melanine intensief",null,"03",2]
[4159001,"Post.Kan.Berner melanine schimmel",null,"03",2]
[4161001,"Post.Kan.Berner bont intensief",null,"03",2]
[4163001,"Post.Kan.Berner bont schimmel",null,"03",2]
[4165001,"Post.Kan.Berner alle witfactorigen",null,"03",2]
[4167001,"Post.Kan.Rheinlander gladkop geel lipochroom intensief",null,"03",2]
[4169001,"Post.Kan.Rheinlander gladkop geel lipochroom schimmel",null,"03",2]
[4171001,"Post.Kan.Rheinlander gladkop rood lipochroom intensief",null,"03",2]
[4173001,"Post.Kan.Rheinlander gladkop rood lipochroom schimmel",null,"03",2]
[4175001,"Post.Kan.Rheinlander gladkop wit",null,"03",2]
[4177001,"Post.Kan.Rheinlander gekuifd geel lipochroom intensief",null,"03",2]
[4179001,"Post.Kan.Rheinlander gekuifd geel lipochroom schimmel",null,"03",2]
[4181001,"Post.Kan.Rheinlander gekuifd rood lipochroom intensief",null,"03",2]
[4183001,"Post.Kan.Rheinlander gekuifd rood lipochroom schimmel",null,"03",2]
[4185001,"Post.Kan.Rheinlander gekuifd wit",null,"03",2]
[4187001,"Post.Kan.Llarget Espanol lipochroom intensief",null,"03",2]
[4189001,"Post.Kan.Llarget Espanol lipochroom schimmel",null,"03",2]
[4191001,"Post.Kan.Llarget Espanol melanine intensief",null,"03",2]
[4193001,"Post.Kan.Llarget Espanol melanine schimmel",null,"03",2]
[4195001,"Post.Kan.Llarget Espanol bont intensief",null,"03",2]
[4197001,"Post.Kan.Llarget Espanol bont schimmel",null,"03",2]
[4199001,"Post.Kan.Llarget Espanol alle witfactorigen",null,"03",2]
[4201001,"Post.Kan.Belgische Bult lipochroom intensief",null,"03",2]
[4203001,"Post.Kan.Belgische Bult lipochroom schimmel",null,"03",2]
[4205001,"Post.Kan.Belgische Bult melanine intensief",null,"03",2]
[4207001,"Post.Kan.Belgische Bult melanine schimmel",null,"03",2]
[4209001,"Post.Kan.Belgische Bult bont intensief",null,"03",2]
[4211001,"Post.Kan.Belgische Bult bont schimmel",null,"03",2]
[4213001,"Post.Kan.Belgische Bult alle witfactorigen",null,"03",2]
[4215001,"Post.Kan.Munchener lipochroom intensief",null,"03",2]
[4217001,"Post.Kan.Munchener lipochroom schimmel",null,"03",2]
[4219001,"Post.Kan.Munchener melanine intensief",null,"03",2]
[4221001,"Post.Kan.Munchener melanine schimmel",null,"03",2]
[4223001,"Post.Kan.Munchener bont intensief",null,"03",2]
[4225001,"Post.Kan.Munchener bont schimmel",null,"03",2]
[4227001,"Post.Kan.Munchener alle witfactorigen",null,"03",2]
[4229001,"Post.Kan.Scotch Fancy lipochroom intensief",null,"05",2]
[4231001,"Post.Kan.Scotch Fancy lipochroom schimmel",null,"05",2]
[4233001,"Post.Kan.Scotch Fancy melanine intensief",null,"05",2]
[4235001,"Post.Kan.Scotch Fancy melanine schimmel",null,"05",2]
[4237001,"Post.Kan.Scotch Fancy bont intensief",null,"05",2]
[4239001,"Post.Kan.Scotch Fancy bont schimmel",null,"05",2]
[4241001,"Post.Kan.Scotch Fancy alle witfactorigen",null,"05",2]
[4243001,"Post.Kan.Japan Hoso lipochroom intensief",null,"05",2]
[4245001,"Post.Kan.Japan Hoso lipochroom schimmel",null,"05",2]
[4247001,"Post.Kan.Japan Hoso melanine intensief",null,"05",2]
[4249001,"Post.Kan.Japan Hoso melanine schimmel",null,"05",2]
[4251001,"Post.Kan.Japan Hoso bont intensief",null,"05",2]
[4253001,"Post.Kan.Japan Hoso bont schimmel",null,"05",2]
[4255001,"Post.Kan.Japan Hoso alle witfactorigen",null,"05",2]
[4257001,"Post.Kan.Raza Espanol lipochroom geel intensief",null,"05",2]
[4259001,"Post.Kan.Raza Espanol lipochroom geel schimmel",null,"05",2]
[4261001,"Post.Kan.Raza Espanol melanine geel intensief",null,"05",2]
[4263001,"Post.Kan.Raza Espanol melanine geel schimmel",null,"05",2]
[4265001,"Post.Kan.Raza Espanol bont geel intensief",null,"05",2]
[4267001,"Post.Kan.Raza Espanol bont geel schimmel",null,"05",2]
[4269001,"Post.Kan.Raza Espanol alle witfactorigen",null,"05",2]
[4271001,"Post.Kan.Raza Espanol lipochroom rood intensief",null,"05",2]
[4273001,"Post.Kan.Raza Espanol lipochroom rood schimmel",null,"05",2]
[4275001,"Post.Kan.Raza Espanol melanine rood intensief",null,"05",2]
[4277001,"Post.Kan.Raza Espanol melanine rood schimmel",null,"05",2]
[4279001,"Post.Kan.Raza Espanol bont rood intensief",null,"05",2]
[4281001,"Post.Kan.Raza Espanol bont rood schimmel",null,"05",2]
[4283001,"Post.Kan.Border lipochroom intensief",null,"05",2]
[4285001,"Post.Kan.Border lipochroom schimmel",null,"05",2]
[4287001,"Post.Kan.Border melanine intensief",null,"05",2]
[4289001,"Post.Kan.Border melanine schimmel",null,"05",2]
[4291001,"Post.Kan.Border bont intensief",null,"05",2]
[4293001,"Post.Kan.Border bont schimmel",null,"05",2]
[4295001,"Post.Kan.Border alle witfactorigen",null,"05",2]
[4297001,"Post.Kan.Fife Fancy lipochroom intensief",null,"05",2]
[4299001,"Post.Kan.Fife Fancy lipochroom schimmel",null,"05",2]
[4301001,"Post.Kan.Fife Fancy melanine intensief",null,"05",2]
[4303001,"Post.Kan.Fife Fancy melanine schimmel",null,"05",2]
[4305001,"Post.Kan.Fife Fancy bont intensief",null,"05",2]
[4307001,"Post.Kan.Fife Fancy bont schimmel",null,"05",2]
[4309001,"Post.Kan.Fife Fancy alle witfactorigen",null,"05",2]
[4311001,"Post.Kan.Norwich lipochroom geel intensief",null,"02",2]
[4313001,"Post.Kan.Norwich lipochroom geel schimmel",null,"02",2]
[4315001,"Post.Kan.Norwich melanine geel intensief",null,"02",2]
[4317001,"Post.Kan.Norwich melanine geel schimmel",null,"02",2]
[4319001,"Post.Kan.Norwich bont geel intensief",null,"02",2]
[4321001,"Post.Kan.Norwich bont geel schimmel",null,"02",2]
[4323001,"Post.Kan.Norwich alle witfactorigen",null,"02",2]
[4325001,"Post.Kan.Norwich lipochroom rood intensief",null,"02",2]
[4327001,"Post.Kan.Norwich lipochroom rood schimmel",null,"02",2]
[4329001,"Post.Kan.Norwich melanine rood intensief",null,"02",2]
[4331001,"Post.Kan.Norwich melanine roodschimmel",null,"02",2]
[4333001,"Post.Kan.Norwich bont rood intensief",null,"02",2]
[4335001,"Post.Kan.Norwich bont rood schimmel",null,"02",2]
[4337001,"Post.Kan.Irish Fancy lipochroom intensief",null,"02",2]
[4339001,"Post.Kan.Irish Fancy lipochroom schimmel",null,"02",2]
[4341001,"Post.Kan.Irish Fancy melanine intensief",null,"02",2]
[4343001,"Post.Kan.Irish Fancy melanine schimmel",null,"02",2]
[4345001,"Post.Kan.Irish Fancy bont intensief",null,"02",2]
[4347001,"Post.Kan.Irish Fancy bont schimmel",null,"02",2]
[4349001,"Post.Kan.Irish Fancy alle witfactorigen",null,"02",2]
[4351001,"Post.Kan.Gloster Consort lipochroom intensief",null,"02",2]
[4353001,"Post.Kan.Gloster Consort lipochroom schimmel",null,"02",2]
[4355001,"Post.Kan.Gloster Consort melanine intensief",null,"02",2]
[4357001,"Post.Kan.Gloster Consort melanine schimmel",null,"02",2]
[4359001,"Post.Kan.Gloster Consort bont intensief",null,"02",2]
[4361001,"Post.Kan.Gloster Consort bont schimmel",null,"02",2]
[4363001,"Post.Kan.Gloster Consort alle witfactorigen",null,"02",2]
[4365001,"Post.Kan.Gloster Corona lipochroom intensief",null,"02",2]
[4367001,"Post.Kan.Gloster Corona lipochroom schimmel",null,"02",2]
[4369001,"Post.Kan.Gloster Corona melanine intensief",null,"02",2]
[4371001,"Post.Kan.Gloster Corona melanine schimmel",null,"02",2]
[4373001,"Post.Kan.Gloster Corona bont intensief",null,"02",2]
[4375001,"Post.Kan.Gloster Corona bont schimmel",null,"02",2]
[4377001,"Post.Kan.Gloster Corona alle witfactorigen",null,"02",2]
[4379001,"Post.Kan.Crest-bred gladkop lipochroom intensief",null,"02",2]
[4381001,"Post.Kan.Crest-bred gladkop lipochroom schimmel",null,"02",2]
[4383001,"Post.Kan.Crest-bred gladkop melanine intensief",null,"02",2]
[4385001,"Post.Kan.Crest-bred gladkop melanine schimmel",null,"02",2]
[4387001,"Post.Kan.Crest-bred gladkop bont intensief",null,"02",2]
[4389001,"Post.Kan.Crest-bred gladkop bont schimmel",null,"02",2]
[4391001,"Post.Kan.Crest-Bred gladkop alle witfactorigen",null,"02",2]
[4393001,"Post.Kan.Crested gekuifd lipochroom intensief",null,"02",2]
[4395001,"Post.Kan.Crested gekuifd lipochroom schimmel",null,"02",2]
[4397001,"Post.Kan.Crested gekuifd melanine intensief",null,"02",2]
[4399001,"Post.Kan.Crested gekuifd melanine schimmel",null,"02",2]
[4401001,"Post.Kan.Crested gekuifd bont intensief",null,"02",2]
[4403001,"Post.Kan.Crested gekuifd bont schimmel",null,"02",2]
[4405001,"Post.Kan.Crested gekuifd alle witfactorigen",null,"02",2]
[4407001,"Post.Kan.Arlequim Portugais gladkop T1",null,"02",2]
[4409001,"Post.Kan.Arlequim Portugais gladkop T2",null,"02",2]
[4411001,"Post.Kan.Arlequim Portugais gekuifd T1",null,"02",2]
[4413001,"Post.Kan.Arlequim Portugais gekuifd T2",null,"02",2]
[4415001,"Post.Kan.Duitse kuif wit dominant",null,"02",2]
[4415002,"Post.Kan.Duitse kuif wit",null,"02",2]
[4415003,"Post.Kan.Duitse kuif albino dominant",null,"02",2]
[4415004,"Post.Kan.Duitse kuif albino",null,"02",2]
[4417001,"Post.Kan.Duitse kuif geel intensief",null,"02",2]
[4417002,"Post.Kan.Duitse kuif geel intensief witte pennen",null,"02",2]
[4417003,"Post.Kan.Duitse kuif lutino intensief",null,"02",2]
[4417004,"Post.Kan.Duitse kuif lutino intensief witte pennen",null,"02",2]
[4417005,"Post.Kan.Duitse kuif geelivoor intensief",null,"02",2]
[4417006,"Post.Kan.Duitse kuif geelivoor intensief witte pennen",null,"02",2]
[4417007,"Post.Kan.Duitse kuif lutino-ivoor intensief",null,"02",2]
[4417008,"Post.Kan.Duitse kuif lutino-ivoor intensief witte pennen",null,"02",2]
[4417009,"Post.Kan.Duitse kuif geel schimmel",null,"02",2]
[4417010,"Post.Kan.Duitse kuif geel schimmel witte pennen",null,"02",2]
[4417011,"Post.Kan.Duitse kuif lutino schimmel",null,"02",2]
[4417012,"Post.Kan.Duitse kuif lutino schimmel witte pennen",null,"02",2]
[4417013,"Post.Kan.Duitse kuif geelivoor schimmel",null,"02",2]
[4417014,"Post.Kan.Duitse kuif geelivoor schimmel witte pennen",null,"02",2]
[4417015,"Post.Kan.Duitse kuif lutino-ivoor schimmel",null,"02",2]
[4417016,"Post.Kan.Duitse kuif lutino-ivoor schimmel witte pennen",null,"02",2]
[4425001,"Post.Kan.Duitse kuif geel mozaiek T1",null,"02",2]
[4425002,"Post.Kan.Duitse kuif geelivoor mozaiek T1",null,"02",2]
[4425003,"Post.Kan.Duitse kuif lutino mozaiek T1",null,"02",2]
[4425004,"Post.Kan.Duitse kuif lutino-ivoor mozaiek T1",null,"02",2]
[4425005,"Post.Kan.Duitse kuif geel mozaiek T2",null,"02",2]
[4425006,"Post.Kan.Duitse kuif geelivoor mozaiek T2",null,"02",2]
[4425007,"Post.Kan.Duitse kuif lutino mozaiek T2",null,"02",2]
[4425008,"Post.Kan.Duitse kuif lutino-ivoor mozaiek T2",null,"02",2]
[4441001,"Post.Kan.Duitse kuif rood intensief",null,"02",2]
[4441002,"Post.Kan.Duitse kuif rood intensief witte pennen",null,"02",2]
[4441003,"Post.Kan.Duitse kuif rubino intensief",null,"02",2]
[4441004,"Post.Kan.Duitse kuif rubino intensief witte pennen",null,"02",2]
[4441005,"Post.Kan.Duitse kuif roodivoor intensief",null,"02",2]
[4441006,"Post.Kan.Duitse kuif roodivoor intensief witte pennen",null,"02",2]
[4441007,"Post.Kan.Duitse kuif rubino-ivoor intensief",null,"02",2]
[4441008,"Post.Kan.Duitse kuif rubino-ivoor intensief witte pennen",null,"02",2]
[4441009,"Post.Kan.Duitse kuif rood schimmel",null,"02",2]
[4441010,"Post.Kan.Duitse kuif rood schimmel witte pennen",null,"02",2]
[4441011,"Post.Kan.Duitse kuif rubino schimmel",null,"02",2]
[4441012,"Post.Kan.Duitse kuif rubino schimmel witte pennen",null,"02",2]
[4441013,"Post.Kan.Duitse kuif roodivoor schimmel",null,"02",2]
[4441014,"Post.Kan.Duitse kuif roodivoor schimmel witte pennen",null,"02",2]
[4441015,"Post.Kan.Duitse kuif rubino-ivoor schimmel",null,"02",2]
[4441016,"Post.Kan.Duitse kuif rubino-ivoor schimmel witte pennen",null,"02",2]
[4473001,"Post.Kan.Duitse kuif rood mozaiek T1",null,"02",2]
[4473002,"Post.Kan.Duitse kuif roodivoor mozaiek T1",null,"02",2]
[4473003,"Post.Kan.Duitse kuif rubino mozaiek T1",null,"02",2]
[4473004,"Post.Kan.Duitse kuif rubino-ivoor mozaiek T1",null,"02",2]
[4473005,"Post.Kan.Duitse kuif rood mozaiek T2",null,"02",2]
[4473006,"Post.Kan.Duitse kuif roodivoor mozaiek T2",null,"02",2]
[4473007,"Post.Kan.Duitse kuif rubino mozaiek T2",null,"02",2]
[4473008,"Post.Kan.Duitse kuif rubino-ivoor mozaiek T2",null,"02",2]
[4489001,"Post.Kan.Duitse kuif zwartserie klassiek intensief",null,"02",2]
[4489002,"Post.Kan.Duitse kuif zwartserie klassiek schimmel",null,"02",2]
[4489003,"Post.Kan.Duitse kuif zwartserie klassiek mozaiek T1",null,"02",2]
[4489004,"Post.Kan.Duitse kuif zwartserie klassiek mozaiek T2",null,"02",2]
[4497001,"Post.Kan.Duitse kuif bruinserie klassiek intensief",null,"02",2]
[4497002,"Post.Kan.Duitse kuif bruinserie klassiek schimmel",null,"02",2]
[4497003,"Post.Kan.Duitse kuif bruinserie klassiek mozaiek T1",null,"02",2]
[4497004,"Post.Kan.Duitse kuif bruinserie klassiek mozaiek T2",null,"02",2]
[4505001,"Post.Kan.Duitse kuif agaatserie klassiek intensief",null,"02",2]
[4505002,"Post.Kan.Duitse kuif agaatserie klassiek schimmel",null,"02",2]
[4505003,"Post.Kan.Duitse kuif agaatserie klassiek mozaiek T1",null,"02",2]
[4505004,"Post.Kan.Duitse kuif agaatserie klassiek mozaiek T2",null,"02",2]
[4513001,"Post.Kan.Duitse kuif isabelserie klassiek intensief",null,"02",2]
[4513002,"Post.Kan.Duitse kuif isabelserie klassiek schimmel",null,"02",2]
[4513003,"Post.Kan.Duitse kuif isabelserie klassiek mozaiek T1",null,"02",2]
[4513004,"Post.Kan.Duitse kuif isabelserie klassiek mozaiek T2",null,"02",2]
[4521001,"Post.Kan.Duitse kuif zwartserie mut. intensief",null,"02",2]
[4521002,"Post.Kan.Duitse kuif zwartserie mut. schimmel",null,"02",2]
[4521003,"Post.Kan.Duitse kuif zwartserie mut. mozaiek T1",null,"02",2]
[4521004,"Post.Kan.Duitse kuif zwartserie mut. mozaiek T2",null,"02",2]
[4529001,"Post.Kan.Duitse kuif bruinserie mut. intensief",null,"02",2]
[4529002,"Post.Kan.Duitse kuif bruinserie mut. schimmel",null,"02",2]
[4529003,"Post.Kan.Duitse kuif bruinserie mut. mozaiek T1",null,"02",2]
[4529004,"Post.Kan.Duitse kuif bruinserie mut. mozaiek T2",null,"02",2]
[4537001,"Post.Kan.Duitse kuif agaatserie mut. intensief",null,"02",2]
[4537002,"Post.Kan.Duitse kuif agaatserie mut. schimmel",null,"02",2]
[4537003,"Post.Kan.Duitse kuif agaatserie mut. mozaiek T1",null,"02",2]
[4537004,"Post.Kan.Duitse kuif agaatserie mut. mozaiek T2",null,"02",2]
[4545001,"Post.Kan.Duitse kuif isabelserie mut. intensief",null,"02",2]
[4545002,"Post.Kan.Duitse kuif isabelserie mut. schimmel",null,"02",2]
[4545003,"Post.Kan.Duitse kuif isabelserie mut. mozaiek T1",null,"02",2]
[4545004,"Post.Kan.Duitse kuif isabelserie mut. mozaiek T2",null,"02",2]
[4553001,"Post.Kan.Duitse kuif phaeoserie intensief",null,"02",2]
[4553002,"Post.Kan.Duitse kuif phaeoserie schimmel",null,"02",2]
[4553003,"Post.Kan.Duitse kuif phaeoserie mozaiek T1",null,"02",2]
[4553004,"Post.Kan.Duitse kuif phaeoserie mozaiek T2",null,"02",2]
[4561001,"Post.Kan.Duitse kuif satinetserie intensief",null,"02",2]
[4561002,"Post.Kan.Duitse kuif satinetserie schimmel",null,"02",2]
[4561003,"Post.Kan.Duitse kuif satinetserie mozaiek T1",null,"02",2]
[4561004,"Post.Kan.Duitse kuif satinetserie mozaiek T2",null,"02",2]
[4569001,"Post.Kan.Lizard wit/wit dominant cap",null,"02",2]
[4571001,"Post.Kan.Lizard wit/wit dominant gebroken cap",null,"02",2]
[4573001,"Post.Kan.lizard wit/wit dominant zonder cap",null,"02",2]
[4575001,"Post.Kan.Lizard geel intensief cap",null,"02",2]
[4577001,"Post.Kan.Lizard geel intensief gebroken cap",null,"02",2]
[4579001,"Post.Kan.Lizard geel intensief zonder cap",null,"02",2]
[4581001,"Post.Kan.Lizard geel schimmel cap",null,"02",2]
[4583001,"Post.Kan.Lizard geel schimmel gebroken cap",null,"02",2]
[4585001,"Post.Kan.Lizard geel schimmel zonder cap",null,"02",2]
[4587001,"Post.Kan.Lizard rood intensief cap",null,"02",2]
[4589001,"Post.Kan.Lizard rood intensief gebroken cap",null,"02",2]
[4591001,"Post.Kan.Lizard rood intensief zonder cap",null,"02",2]
[4593001,"Post.Kan.Lizard rood schimmel cap",null,"02",2]
[4595001,"Post.Kan.Lizard rood schimmel gebroken cap",null,"02",2]
[4597001,"Post.Kan.Lizard rood schimmel zonder cap",null,"02",2]
[4599001,"Post.Kan.London Fancy wit",null,"02",2]
[4601001,"Post.Kan.London Fancy geel intensief",null,"02",2]
[4603001,"Post.Kan.London Fancy geel schimmel",null,"02",2]
[4605001,"Post.Kan.Columbus Fancy gladkop lipochroom geel intensief",null,"02",2]
[4605002,"Post.Kan.Columbus Fancy gladkop lipochroom geel schimmel",null,"02",2]
[4606001,"Post.Kan.Columbus Fancy gladkop melanine intensief",null,"02",2]
[4606002,"Post.Kan.Columbus Fancy gladkop melanine schimmel",null,"02",2]
[4607001,"Post.Kan.Columbus Fancy gladkop bont intensief",null,"02",2]
[4607002,"Post.Kan.Columbus Fancy gladkop bont schimmel",null,"02",2]
[4611001,"Post.Kan.Columbus Fancy gladkop alle witfactorigen",null,"02",2]
[4613001,"Post.Kan.Columbus Fancy gekuifd lipochroom geel intensief",null,"02",2]
[4613002,"Post.Kan.Columbus Fancy gekuifd lipochroom geel schimmel",null,"02",2]
[4617001,"Post.Kan.Columbus Fancy gekuifd melanine intensief",null,"02",2]
[4617002,"Post.Kan.Columbus Fancy gekuifd melanine schimmel",null,"02",2]
[4617003,"Post.Kan.Columbus Fancy gekuifd bont intensief",null,"02",2]
[4617004,"Post.Kan.Columbus Fancy gekuifd bont schimmel",null,"02",2]
[4625001,"Post.Kan.Columbus Fancy gekuifd alle witfactorigen",null,"02",2]
[4627001,"Post.Kan.Stafford Canary gladkop rood lipochroom intensief",null,"02",2]
[4627002,"Post.Kan.Stafford Canary gladkop rood lipochroom schimmel",null,"02",2]
[4631001,"Post.Kan.Stafford Canary gladkop rood melanine intensief",null,"02",2]
[4631002,"Post.Kan.Stafford Canary gladkop rood melanine schimmel",null,"02",2]
[4635001,"Post.Kan.Stafford Canary gladkop rood bont intensief",null,"02",2]
[4635002,"Post.Kan.Stafford Canary gladkop rood bont schimmel",null,"02",2]
[4639001,"Post.Kan.Stafford Canary gekuifd rood lipochroom intensief",null,"02",2]
[4639002,"Post.Kan.Stafford Canary gekuifd rood lipochroom schimmel",null,"02",2]
[4643001,"Post.Kan.Stafford Canary gekuifd rood melanine intensief",null,"02",2]
[4643002,"Post.Kan.Stafford Canary gekuifd rood melanine schimmel",null,"02",2]
[4647001,"Post.Kan.Stafford Canary gekuifd rood bont intensief",null,"02",2]
[4647002,"Post.Kan.Stafford Canary gekuifd rood bont schimmel",null,"02",2]
[4650001,"Post.Kan.Vectis intensief",null,"02",2]
[4650002,"Post.Kan.Vectis schimmel",null,"02",2]
[4900900,"Post.Kan.Nieuwe nog niet erkende rassen (niet gefriseerd & 3 nieuwe kenmerken)",null,"02",2]
[4999999,"Post.Kan.Nieuwe nog niet erkende rassen (niet gefriseerd & 3 nieuwe kenmerken)",null,"02",2]
[5001001,"Zebravink grijs man",null,"02",3]
[5001002,"Zebravink grijs pop",null,"02",3]
[5002001,"Zebravink bruin man",null,"02",3]
[5002002,"Zebravink bruin pop",null,"02",3]
[5003001,"Zebravink bleekrug grijs man",null,"02",3]
[5003002,"Zebravink bleekrug grijs pop",null,"02",3]
[5004001,"Zebravink bleekrug bruin man",null,"02",3]
[5004002,"Zebravink bleekrug bruin pop",null,"02",3]
[5005001,"Zebravink masker grijs man",null,"02",3]
[5005002,"Zebravink masker grijs pop",null,"02",3]
[5006001,"Zebravink masker bruin man",null,"02",3]
[5006002,"Zebravink masker bruin pop",null,"02",3]
[5007001,"Zebravink SL ino grijs man",null,"02",3]
[5007002,"Zebravink SL ino grijs pop",null,"02",3]
[5008001,"Zebravink SL ino bruin man",null,"02",3]
[5008002,"Zebravink SL ino bruin pop",null,"02",3]
[5009001,"Zebravink wit",null,"02",3]
[5010001,"Zebravinken bont grijs man serie inclusief alle mut",null,"02",3]
[5010002,"Zebravinken bont grijs pop serie inclusief alle mut",null,"02",3]
[5010003,"Zebravinken bont bruin man serie inclusief alle mut",null,"02",3]
[5010004,"Zebravinken bont bruin pop serie inclusief alle mut",null,"02",3]
[5010005,"Zebravinken bont bleekrug man serie inclusief alle mut",null,"02",3]
[5010006,"Zebravinken bont bleekrug pop serie inclusief alle mut",null,"02",3]
[5011001,"Zebravink getekende witkop grijs serie m/p",null,"02",3]
[5011002,"Zebravink getekende witkop bruin serie m/p",null,"02",3]
[5011003,"Zebravink getekende met cap grijs serie m/p",null,"02",3]
[5011004,"Zebravink getekende met cap bruin serie m/p",null,"02",3]
[5011005,"Zebravink overig getekende grijs serie m/p",null,"02",3]
[5011006,"Zebravink overig getekende bruin serie m/p",null,"02",3]
[5012001,"Zebravink oranjeborst grijs man",null,"02",3]
[5012002,"Zebravink oranjeborst grijs pop",null,"02",3]
[5012003,"Zebravink oranjeborst bruin man",null,"02",3]
[5012004,"Zebravink oranjeborst bruin pop",null,"02",3]
[5012005,"Zebravink oranjeborst bleekrug grijs man",null,"02",3]
[5012006,"Zebravink oranjeborst bleekrug grijs pop",null,"02",3]
[5012007,"Zebravink oranjeborst bleekrug bruin man",null,"02",3]
[5012008,"Zebravink oranjeborst bleekrug bruin pop",null,"02",3]
[5012009,"Zebravink oranjeborst masker grijs man",null,"02",3]
[5012010,"Zebravink oranjeborst masker grijs pop",null,"02",3]
[5012011,"Zebravink oranjeborst masker bruin man",null,"02",3]
[5012012,"Zebravink oranjeborst masker bruin pop",null,"02",3]
[5012030,"Zebravink oranjeborst topaas grijs man",null,"02",3]
[5012031,"Zebravink oranjeborst topaas grijs pop",null,"02",3]
[5012032,"Zebravink oranjeborst topaas bruin man",null,"02",3]
[5012033,"Zebravink oranjeborst topaas bruin pop",null,"02",3]
[5012034,"Zebravink oranjeborst topaas bleekrug grijs man",null,"02",3]
[5012035,"Zebravink oranjeborst topaas bleekrug grijs pop",null,"02",3]
[5012036,"Zebravink oranjeborst witborst grijs man",null,"02",3]
[5012037,"Zebravink oranjeborst witborst grijs pop",null,"02",3]
[5012038,"Zebravink oranjeborst witborst bruin man",null,"02",3]
[5012039,"Zebravink oranjeborst witborst bruin pop",null,"02",3]
[5012040,"Zebravink oranjeborst witborst bleekrug grijs man",null,"02",3]
[5012041,"Zebravink oranjeborst witborst bleekrug grijs pop",null,"02",3]
[5012042,"Zebravink oranjeborst isabel grijs man",null,"02",3]
[5012043,"Zebravink oranjeborst isabel grijs pop",null,"02",3]
[5012044,"Zebravink oranjeborst isabel bruin man",null,"02",3]
[5012045,"Zebravink oranjeborst isabel bruin pop",null,"02",3]
[5012046,"Zebravink oranjeborst wang grijs man",null,"02",3]
[5012047,"Zebravink oranjeborst wang grijs pop",null,"02",3]
[5012048,"Zebravink oranjeborst wang bruin man",null,"02",3]
[5012049,"Zebravink oranjeborst wang bruin pop",null,"02",3]
[5013001,"Zebravink oranjeborst zwartborst grijs man",null,"02",3]
[5013002,"Zebravink oranjeborst zwartborst grijs pop",null,"02",3]
[5013003,"Zebravink oranjeborst zwartborst bruin man",null,"02",3]
[5013004,"Zebravink oranjeborst zwartborst bruin pop",null,"02",3]
[5013005,"Zebravink oranjeborst zwartborst bleekrug grijs man",null,"02",3]
[5013006,"Zebravink oranjeborst zwartborst bleekrug grijs pop",null,"02",3]
[5013007,"Zebravink oranjeborst zwartborst bleekrug bruin man",null,"02",3]
[5013008,"Zebravink oranjeborst zwartborst bleekrug bruin pop",null,"02",3]
[5013009,"Zebravink oranjeborst zwartborst masker grijs man",null,"02",3]
[5013010,"Zebravink oranjeborst zwartborst masker grijs pop",null,"02",3]
[5013011,"Zebravink oranjeborst zwartborst masker bruin man",null,"02",3]
[5013012,"Zebravink oranjeborst zwartborst masker bruin pop",null,"02",3]
[5013030,"Zebravink oranjeborst zwartborst topaas grijs man",null,"02",3]
[5013031,"Zebravink oranjeborst zwartborst topaas grijs pop",null,"02",3]
[5013032,"Zebravink oranjeborst zwartborst topaas bruin man",null,"02",3]
[5013033,"Zebravink oranjeborst zwartborst topaas bruin pop",null,"02",3]
[5013034,"Zebravink oranjeborst zwartborst topaas bleekrug grijs man",null,"02",3]
[5013035,"Zebravink oranjeborst zwartborst topaas bleekrug grijs pop",null,"02",3]
[5013036,"Zebravink oranjeborst zwartborst witborst grijs man",null,"02",3]
[5013037,"Zebravink oranjeborst zwartborst witborst grijs pop",null,"02",3]
[5013038,"Zebravink oranjeborst zwartborst witborst bruin man",null,"02",3]
[5013039,"Zebravink oranjeborst zwartborst witborst bruin pop",null,"02",3]
[5013040,"Zebravink oranjeborst zwartborst isabel grijs man",null,"02",3]
[5013041,"Zebravink oranjeborst zwartborst isabel grijs pop",null,"02",3]
[5013042,"Zebravink oranjeborst zwartborst isabel bruin man",null,"02",3]
[5013043,"Zebravink oranjeborst zwartborst isabel bruin pop",null,"02",3]
[5013044,"Zebravink oranjeborst zwartborst wang grijs man",null,"02",3]
[5013045,"Zebravink oranjeborst zwartborst wang grijs pop",null,"02",3]
[5013046,"Zebravink oranjeborst zwartborst wang bruin man",null,"02",3]
[5013047,"Zebravink oranjeborst zwartborst wang bruin pop",null,"02",3]
[5014001,"Zebravink oranjeborst blackface grijs man",null,"02",3]
[5014002,"Zebravink oranjeborst blackface grijs pop",null,"02",3]
[5014003,"Zebravink oranjeborst blackface bruin man",null,"02",3]
[5014004,"Zebravink oranjeborst blackface bruin pop",null,"02",3]
[5014005,"Zebravink oranjeborst blackface bleekrug grijs man",null,"02",3]
[5014006,"Zebravink oranjeborst blackface bleekrug grijs pop",null,"02",3]
[5014007,"Zebravink oranjeborst blackface bleekrug bruin man",null,"02",3]
[5014008,"Zebravink oranjeborst blackface bleekrug bruin pop",null,"02",3]
[5014009,"Zebravink oranjeborst blackface masker grijs man",null,"02",3]
[5014010,"Zebravink oranjeborst blackface masker grijs pop",null,"02",3]
[5014011,"Zebravink oranjeborst blackface masker bruin man",null,"02",3]
[5014012,"Zebravink oranjeborst blackface masker bruin pop",null,"02",3]
[5014013,"Zebravink oranjeborst blackface topaas grijs man",null,"02",3]
[5014014,"Zebravink oranjeborst blackface topaas grijs pop",null,"02",3]
[5014015,"Zebravink oranjeborst blackface topaas bruin man",null,"02",3]
[5014016,"Zebravink oranjeborst blackface topaas bruin pop",null,"02",3]
[5014017,"Zebravink oranjeborst blackface topaas bleekrug grijs man",null,"02",3]
[5014018,"Zebravink oranjeborst blackface topaas bleekrug grijs pop",null,"02",3]
[5014019,"Zebravink oranjeborst blackface isabel grijs man",null,"02",3]
[5014020,"Zebravink oranjeborst blackface isabel grijs pop",null,"02",3]
[5014021,"Zebravink oranjeborst blackface isabel bruin man",null,"02",3]
[5014022,"Zebravink oranjeborst blackface isabel bruin pop",null,"02",3]
[5015001,"Zebravink oranjeborst zwartborst blackface grijs man",null,"02",3]
[5015002,"Zebravink oranjeborst zwartborst blackface grijs pop",null,"02",3]
[5015003,"Zebravink oranjeborst zwartborst blackface bruin man",null,"02",3]
[5015004,"Zebravink oranjeborst zwartborst blackface bruin pop",null,"02",3]
[5015005,"Zebravink oranjeborst zwartborst blackface bleekrug grijs man",null,"02",3]
[5015006,"Zebravink oranjeborst zwartborst blackface bleekrug grijs pop",null,"02",3]
[5015007,"Zebravink oranjeborst zwartborst blackface bleekrug bruin man",null,"02",3]
[5015008,"Zebravink oranjeborst zwartborst blackface bleekrug bruin pop",null,"02",3]
[5015009,"Zebravink oranjeborst zwartborst blackface masker grijs man",null,"02",3]
[5015010,"Zebravink oranjeborst zwartborst blackface masker grijs pop",null,"02",3]
[5015011,"Zebravink oranjeborst zwartborst blackface masker bruin man",null,"02",3]
[5015012,"Zebravink oranjeborst zwartborst blackface masker bruin pop",null,"02",3]
[5015013,"Zebravink oranjeborst zwartborst blackface topaas grijs man",null,"02",3]
[5015014,"Zebravink oranjeborst zwartborst blackface topaas grijs pop",null,"02",3]
[5015015,"Zebravink oranjeborst zwartborst blackface topaas bruin man",null,"02",3]
[5015016,"Zebravink oranjeborst zwartborst blackface topaas bruin pop",null,"02",3]
[5015017,"Zebravink oranjeborst zwartborst blackface topaas bleekrug grijs man",null,"02",3]
[5015018,"Zebravink oranjeborst zwartborst blackface topaas bleekrug grijs pop",null,"02",3]
[5015019,"Zebravink oranjeborst zwartborst blackface isabel grijs man",null,"02",3]
[5015020,"Zebravink oranjeborst zwartborst blackface isabel grijs pop",null,"02",3]
[5015021,"Zebravink oranjeborst zwartborst blackface isabel bruin man",null,"02",3]
[5015022,"Zebravink oranjeborst zwartborst blackface isabel bruin pop",null,"02",3]
[5020001,"Zebravink zwartborst grijs man",null,"02",3]
[5020002,"Zebravink zwartborst grijs pop",null,"02",3]
[5020003,"Zebravink zwartborst bruin man",null,"02",3]
[5020004,"Zebravink zwartborst bruin pop",null,"02",3]
[5020005,"Zebravink zwartborst bleekrug grijs man",null,"02",3]
[5020006,"Zebravink zwartborst bleekrug grijs pop",null,"02",3]
[5020007,"Zebravink zwartborst bleekrug bruin man",null,"02",3]
[5020008,"Zebravink zwartborst bleekrug bruin pop",null,"02",3]
[5020009,"Zebravink zwartborst masker grijs man",null,"02",3]
[5020010,"Zebravink zwartborst masker grijs pop",null,"02",3]
[5020011,"Zebravink zwartborst masker bruin man",null,"02",3]
[5020012,"Zebravink zwartborst masker bruin pop",null,"02",3]
[5020013,"Zebravink zwartborst topaas grijs man",null,"02",3]
[5020014,"Zebravink zwartborst topaas grijs pop",null,"02",3]
[5020015,"Zebravink zwartborst topaas bruin man",null,"02",3]
[5020016,"Zebravink zwartborst topaas bruin pop",null,"02",3]
[5020017,"Zebravink zwartborst topaas bleekrug grijs man",null,"02",3]
[5020018,"Zebravink zwartborst topaas bleekrug grijs pop",null,"02",3]
[5020019,"Zebravink zwartborst witborst grijs man",null,"02",3]
[5020020,"Zebravink zwartborst witborst grijs pop",null,"02",3]
[5020021,"Zebravink zwartborst witborst bruin man",null,"02",3]
[5020022,"Zebravink zwartborst witborst bruin pop",null,"02",3]
[5020023,"Zebravink zwartborst witborst bleekrug grijs man",null,"02",3]
[5020024,"Zebravink zwartborst witborst bleekrug grijs pop",null,"02",3]
[5020025,"Zebravink zwartborst isabel grijs man",null,"02",3]
[5020026,"Zebravink zwartborst isabel grijs pop",null,"02",3]
[5020027,"Zebravink zwartborst isabel bruin man",null,"02",3]
[5020028,"Zebravink zwartborst isabel bruin pop",null,"02",3]
[5020029,"Zebravink zwartborst wang grijs man",null,"02",3]
[5020030,"Zebravink zwartborst wang grijs pop",null,"02",3]
[5020031,"Zebravink zwartborst wang bruin man",null,"02",3]
[5020032,"Zebravink zwartborst wang bruin pop",null,"02",3]
[5020033,"Zebravink zwartborst bleekwang grijs man",null,"02",3]
[5020034,"Zebravink zwartborst bleekwang bruin man",null,"02",3]
[5020040,"Zebravink zwartborst gezoomd grijs man",null,"02",3]
[5020041,"Zebravink zwartborst gezoomd grijs pop",null,"02",3]
[5021001,"Zebravink zwartborst blackface grijs man",null,"02",3]
[5021002,"Zebravink zwartborst blackface grijs pop",null,"02",3]
[5021003,"Zebravink zwartborst blackface bruin man",null,"02",3]
[5021004,"Zebravink zwartborst blackface bruin pop",null,"02",3]
[5021005,"Zebravink zwartborst blackface bleekrug grijs man",null,"02",3]
[5021006,"Zebravink zwartborst blackface bleekrug grijs pop",null,"02",3]
[5021007,"Zebravink zwartborst blackface bleekrug bruin man",null,"02",3]
[5021008,"Zebravink zwartborst blackface bleekrug bruin pop",null,"02",3]
[5021009,"Zebravink zwartborst blackface masker grijs man",null,"02",3]
[5021010,"Zebravink zwartborst blackface masker grijs pop",null,"02",3]
[5021011,"Zebravink zwartborst blackface masker bruin man",null,"02",3]
[5021012,"Zebravink zwartborst blackface masker bruin pop",null,"02",3]
[5021013,"Zebravink zwartborst blackface topaas grijs man",null,"02",3]
[5021014,"Zebravink zwartborst blackface topaas grijs pop",null,"02",3]
[5021015,"Zebravink zwartborst blackface topaas bruin man",null,"02",3]
[5021016,"Zebravink zwartborst blackface topaas bruin pop",null,"02",3]
[5021017,"Zebravink zwartborst blackface topaas bleekrug grijs man",null,"02",3]
[5021018,"Zebravink zwartborst blackface topaas bleekrug grijs pop",null,"02",3]
[5021019,"Zebravink zwartborst blackface isabel grijs man",null,"02",3]
[5021020,"Zebravink zwartborst blackface isabel grijs pop",null,"02",3]
[5021021,"Zebravink zwartborst blackface isabel bruin man",null,"02",3]
[5021022,"Zebravink zwartborst blackface wang grijs man",null,"02",3]
[5021023,"Zebravink zwartborst blackface wang grijs pop",null,"02",3]
[5021024,"Zebravink zwartborst blackface wang bruin man",null,"02",3]
[5021025,"Zebravink zwartborst blackface wang bruin pop",null,"02",3]
[5022001,"Zebravink blackface grijs man",null,"02",3]
[5022002,"Zebravink blackface grijs pop",null,"02",3]
[5022003,"Zebravink blackface bruin man",null,"02",3]
[5022004,"Zebravink blackface bruin pop",null,"02",3]
[5022005,"Zebravink blackface bleekrug grijs man",null,"02",3]
[5022006,"Zebravink blackface bleekrug grijs pop",null,"02",3]
[5022007,"Zebravink blackface bleekrug bruin man",null,"02",3]
[5022008,"Zebravink blackface bleekrug bruin pop",null,"02",3]
[5022009,"Zebravink blackface masker grijs man",null,"02",3]
[5022010,"Zebravink blackface masker grijs pop",null,"02",3]
[5022011,"Zebravink blackface masker bruin man",null,"02",3]
[5022012,"Zebravink blackface masker bruin pop",null,"02",3]
[5022013,"Zebravink blackface topaas grijs man",null,"02",3]
[5022014,"Zebravink blackface topaas grijs pop",null,"02",3]
[5022015,"Zebravink blackface topaas bruin man",null,"02",3]
[5022016,"Zebravink blackface topaas bruin pop",null,"02",3]
[5022017,"Zebravink blackface topaas bleekrug grijs man",null,"02",3]
[5022018,"Zebravink blackface topaas bleekrug grijs pop",null,"02",3]
[5022019,"Zebravink blackface isabel grijs man",null,"02",3]
[5022020,"Zebravink blackface isabel grijs pop",null,"02",3]
[5022023,"Zebravink blackface wang grijs man",null,"02",3]
[5022024,"Zebravink blackface wang grijs pop",null,"02",3]
[5022025,"Zebravink blackface wang bruin man",null,"02",3]
[5022026,"Zebravink blackface wang bruin pop",null,"02",3]
[5022027,"Zebravink blackface bleekwang grijs man",null,"02",3]
[5022028,"Zebravink blackface bleekwang bruin man",null,"02",3]
[5022029,"Zebravink blackface gezoomd grijs man",null,"02",3]
[5022030,"Zebravink blackface gezoomd grijs pop",null,"02",3]
[5023001,"Zebravink zwartwang grijs man",null,"02",3]
[5023002,"Zebravink zwartwang grijs pop",null,"02",3]
[5023003,"Zebravink zwartwang bruin man",null,"02",3]
[5023004,"Zebravink zwartwang bruin pop",null,"02",3]
[5023005,"Zebravink zwartwang bleekrug grijs man",null,"02",3]
[5023006,"Zebravink zwartwang bleekrug grijs pop",null,"02",3]
[5023007,"Zebravink zwartwang bleekrug bruin man",null,"02",3]
[5023008,"Zebravink zwartwang bleekrug bruin pop",null,"02",3]
[5023009,"Zebravink zwartwang masker grijs man",null,"02",3]
[5023010,"Zebravink zwartwang masker grijs pop",null,"02",3]
[5023011,"Zebravink zwartwang masker bruin man",null,"02",3]
[5023012,"Zebravink zwartwang masker bruin pop",null,"02",3]
[5024001,"Zebravink zwartwang charcoal grijs man",null,"02",3]
[5024002,"Zebravink zwartwang charcoal grijs pop",null,"02",3]
[5024003,"Zebravink zwartwang charcoal bruin man",null,"02",3]
[5024004,"Zebravink zwartwang charcoal bruin pop",null,"02",3]
[5024005,"Zebravink zwartwang charcoal bleekrug grijs man",null,"02",3]
[5024006,"Zebravink zwartwang charcoal bleekrug grijs pop",null,"02",3]
[5024007,"Zebravink zwartwang charcoal bleekrug bruin man",null,"02",3]
[5024008,"Zebravink zwartwang charcoal bleekrug bruin pop",null,"02",3]
[5024009,"Zebravink zwartwang charcoal masker grijs man",null,"02",3]
[5024010,"Zebravink zwartwang charcoal masker grijs pop",null,"02",3]
[5024011,"Zebravink zwartwang charcoal masker bruin man",null,"02",3]
[5024012,"Zebravink zwartwang charcoal masker bruin pop",null,"02",3]
[5025001,"Zebravink zwartwang topaas grijs man",null,"02",3]
[5025002,"Zebravink zwartwang topaas grijs pop",null,"02",3]
[5025003,"Zebravink zwartwang topaas bruin man",null,"02",3]
[5025004,"Zebravink zwartwang topaas bruin pop",null,"02",3]
[5025005,"Zebravink zwartwang topaas bleekrug grijs man",null,"02",3]
[5025006,"Zebravink zwartwang topaas bleekrug grijs pop",null,"02",3]
[5025007,"Zebravink zwartwang isabel grijs man",null,"02",3]
[5025008,"Zebravink zwartwang isabel grijs pop",null,"02",3]
[5025009,"Zebravink zwartwang isabel bleekrug grijs man",null,"02",3]
[5025010,"Zebravink zwartwang isabel bleekrug grijs pop",null,"02",3]
[5026001,"Zebravink zwartwang wang grijs man",null,"02",3]
[5026002,"Zebravink zwartwang wang grijs pop",null,"02",3]
[5026003,"Zebravink zwartwang wang bruin man",null,"02",3]
[5026004,"Zebravink zwartwang wang bruin pop",null,"02",3]
[5026005,"Zebravink zwartwang wang bleekrug man",null,"02",3]
[5026006,"Zebravink zwartwang wang bleekrug pop",null,"02",3]
[5026007,"Zebravink zwartwang wang bleekrug bruin man",null,"02",3]
[5026008,"Zebravink zwartwang wang bleekrug bruin pop",null,"02",3]
[5026020,"Zebravink zwartwang gezoomd grijs man",null,"02",3]
[5026021,"Zebravink zwartwang gezoomd grijs pop",null,"02",3]
[5027001,"Zebravink zwartwang zwartborst grijs man",null,"02",3]
[5027002,"Zebravink zwartwang zwartborst grijs pop",null,"02",3]
[5027003,"Zebravink zwartwang zwartborst bruin man",null,"02",3]
[5027004,"Zebravink zwartwang zwartborst bruin pop",null,"02",3]
[5027005,"Zebravink zwartwang zwartborst bleekrug grijs man",null,"02",3]
[5027006,"Zebravink zwartwang zwartborst bleekrug grijs pop",null,"02",3]
[5027007,"Zebravink zwartwang zwartborst bleekrug bruin man",null,"02",3]
[5027008,"Zebravink zwartwang zwartborst bleekrug bruin pop",null,"02",3]
[5027009,"Zebravink zwartwang zwartborst masker grijs man",null,"02",3]
[5027010,"Zebravink zwartwang zwartborst masker grijs pop",null,"02",3]
[5027011,"Zebravink zwartwang zwartborst masker bruin man",null,"02",3]
[5027012,"Zebravink zwartwang zwartborst masker bruin pop",null,"02",3]
[5027013,"Zebravink zwartwang zwartborst topaas grijs man",null,"02",3]
[5027014,"Zebravink zwartwang zwartborst topaas grijs pop",null,"02",3]
[5027015,"Zebravink zwartwang zwartborst topaas bruin man",null,"02",3]
[5027016,"Zebravink zwartwang zwartborst topaas bruin pop",null,"02",3]
[5027017,"Zebravink zwartwang zwartborst isabel grijs man",null,"02",3]
[5027018,"Zebravink zwartwang zwartborst isabel grijs pop",null,"02",3]
[5027019,"Zebravink zwartwang zwartborst isabel bleekrug grijs man",null,"02",3]
[5027020,"Zebravink zwartwang zwartborst isabel bleekrug grijs pop",null,"02",3]
[5028001,"Zebravink zwartwang blackface grijs man",null,"02",3]
[5028002,"Zebravink zwartwang blackface grijs pop",null,"02",3]
[5028003,"Zebravink zwartwang blackface bruin man",null,"02",3]
[5028004,"Zebravink zwartwang blackface bruin pop",null,"02",3]
[5028005,"Zebravink zwartwang blackface bleekrug grijs man",null,"02",3]
[5028006,"Zebravink zwartwang blackface bleekrug grijs pop",null,"02",3]
[5028007,"Zebravink zwartwang blackface bleekrug bruin man",null,"02",3]
[5028008,"Zebravink zwartwang blackface bleekrug bruin pop",null,"02",3]
[5028009,"Zebravink zwartwang blackface masker grijs man",null,"02",3]
[5028010,"Zebravink zwartwang blackface masker grijs pop",null,"02",3]
[5028011,"Zebravink zwartwang blackface masker bruin man",null,"02",3]
[5028012,"Zebravink zwartwang blackface masker bruin pop",null,"02",3]
[5028013,"Zebravink zwartwang blackface topaas grijs man",null,"02",3]
[5028014,"Zebravink zwartwang blackface topaas grijs pop",null,"02",3]
[5028015,"Zebravink zwartwang blackface topaas bruin man",null,"02",3]
[5028016,"Zebravink zwartwang blackface topaas bruin pop",null,"02",3]
[5028017,"Zebravink zwartwang blackface topaas bleekrug grijs man",null,"02",3]
[5028018,"Zebravink zwartwang blackface topaas bleekrug grijs pop",null,"02",3]
[5028019,"Zebravink zwartwang blackface isabel grijs man",null,"02",3]
[5028020,"Zebravink zwartwang blackface isabel grijs pop",null,"02",3]
[5029001,"Zebravink zwartwang zwartborst blackface grijs man",null,"02",3]
[5029002,"Zebravink zwartwang zwartborst blackface grijs pop",null,"02",3]
[5029003,"Zebravink zwartwang zwartborst blackface bruin man",null,"02",3]
[5029004,"Zebravink zwartwang zwartborst blackface bruin pop",null,"02",3]
[5029005,"Zebravink zwartwang zwartborst blackface bleekrug grijs man",null,"02",3]
[5029006,"Zebravink zwartwang zwartborst blackface bleekrug grijs pop",null,"02",3]
[5029007,"Zebravink zwartwang zwartborst blackface bleekrug bruin man",null,"02",3]
[5029008,"Zebravink zwartwang zwartborst blackface bleekrug bruin pop",null,"02",3]
[5029009,"Zebravink zwartwang zwartborst blackface masker grijs man",null,"02",3]
[5029010,"Zebravink zwartwang zwartborst blackface masker grijs pop",null,"02",3]
[5029011,"Zebravink zwartwang zwartborst blackface masker bruin man",null,"02",3]
[5029012,"Zebravink zwartwang zwartborst blackface masker bruin pop",null,"02",3]
[5029013,"Zebravink zwartwang zwartborst blackface isabel grijs man",null,"02",3]
[5029014,"Zebravink zwartwang zwartborst blackface isabel grijs pop",null,"02",3]
[5030001,"Zebravink charcoal grijs man",null,"02",3]
[5030002,"Zebravink charcoal grijs pop",null,"02",3]
[5030003,"Zebravink charcoal bruin man",null,"02",3]
[5030004,"Zebravink charcoal bruin pop",null,"02",3]
[5030005,"Zebravink charcoal bleekrug grijs man",null,"02",3]
[5030006,"Zebravink charcoal bleekrug grijs pop",null,"02",3]
[5030007,"Zebravink charcoal bleekrug bruin man",null,"02",3]
[5030008,"Zebravink charcoal bleekrug bruin pop",null,"02",3]
[5030009,"Zebravink charcoal masker grijs man",null,"02",3]
[5030010,"Zebravink charcoal masker grijs pop",null,"02",3]
[5030011,"Zebravink charcoal masker bruin man",null,"02",3]
[5030012,"Zebravink charcoal masker bruin pop",null,"02",3]
[5031001,"Zebravink pastel grijs man",null,"02",3]
[5031002,"Zebravink pastel grijs pop",null,"02",3]
[5031003,"Zebravink pastel bruin man",null,"02",3]
[5031004,"Zebravink pastel bruin pop",null,"02",3]
[5031005,"Zebravink pastel bleekrug grijs man",null,"02",3]
[5031006,"Zebravink pastel bleekrug grijs pop",null,"02",3]
[5031007,"Zebravink pastel bleekrug bruin man",null,"02",3]
[5031008,"Zebravink pastel bleekrug bruin pop",null,"02",3]
[5031009,"Zebravink pastel masker grijs man",null,"02",3]
[5031010,"Zebravink pastel masker bruin man",null,"02",3]
[5032001,"Zebravink pastel oranjeborst grijs man",null,"02",3]
[5032002,"Zebravink pastel oranjeborst bruin man",null,"02",3]
[5032003,"Zebravink pastel oranjeborst zwartborst grijs man",null,"02",3]
[5032004,"Zebravink pastel oranjeborst zwartborst bruin man",null,"02",3]
[5032005,"Zebravink pastel oranjeborst blackface grijs man",null,"02",3]
[5032006,"Zebravink pastel oranjeborst blackface bruin man",null,"02",3]
[5032007,"Zebravink pastel oranjeborst zwartborst blackface grijs man",null,"02",3]
[5032008,"Zebravink pastel oranjeborst zwartborst blackface bruin man",null,"02",3]
[5033001,"Zebravink pastel zwartborst grijs man",null,"02",3]
[5033002,"Zebravink pastel zwartborst grijs pop",null,"02",3]
[5033003,"Zebravink pastel zwartborst bruin man",null,"02",3]
[5033004,"Zebravink pastel zwartborst bruin pop",null,"02",3]
[5033005,"Zebravink pastel zwartborst bleekrug grijs man",null,"02",3]
[5033006,"Zebravink pastel zwartborst bleekrug grijs pop",null,"02",3]
[5033007,"Zebravink pastel zwartborst bleekrug bruin man",null,"02",3]
[5033008,"Zebravink pastel zwartborst bleekrug bruin pop",null,"02",3]
[5033009,"Zebravink pastel zwartborst blackface grijs man",null,"02",3]
[5033010,"Zebravink pastel zwartborst blackface grijs pop",null,"02",3]
[5033011,"Zebravink pastel zwartborst blackface bruin man",null,"02",3]
[5033012,"Zebravink pastel zwartborst blackface bruin pop",null,"02",3]
[5033013,"Zebravink pastel zwartborst blackface bleekrug grijs man",null,"02",3]
[5033014,"Zebravink pastel zwartborst blackface bleekrug bruin man",null,"02",3]
[5034001,"Zebravink pastel blackface grijs man",null,"02",3]
[5034002,"Zebravink pastel blackface grijs pop",null,"02",3]
[5034003,"Zebravink pastel blackface bruin man",null,"02",3]
[5034004,"Zebravink pastel blackface bruin pop",null,"02",3]
[5034005,"Zebravink pastel blackface bleekrug grijs man",null,"02",3]
[5034006,"Zebravink pastel blackface bleekrug grijs pop",null,"02",3]
[5034007,"Zebravink pastel blackface bleekrug bruin man",null,"02",3]
[5034008,"Zebravink pastel blackface bleekrug bruin pop",null,"02",3]
[5035001,"Zebravink pastel zwartwang grijs man",null,"02",3]
[5035002,"Zebravink pastel zwartwang grijs pop",null,"02",3]
[5035003,"Zebravink pastel zwartwang bruin man",null,"02",3]
[5035004,"Zebravink pastel zwartwang bruin pop",null,"02",3]
[5035005,"Zebravink pastel zwartwang bleekrug grijs man",null,"02",3]
[5035006,"Zebravink pastel zwartwang bleekrug grijs pop",null,"02",3]
[5035007,"Zebravink pastel zwartwang bleekrug bruin man",null,"02",3]
[5035008,"Zebravink pastel zwartwang bleekrug bruin pop",null,"02",3]
[5036001,"Zebravink pastel charcoal grijs man",null,"02",3]
[5036002,"Zebravink pastel charcoal grijs pop",null,"02",3]
[5036003,"Zebravink pastel charcoal bruin man",null,"02",3]
[5036004,"Zebravink pastel charcoal bruin pop",null,"02",3]
[5036005,"Zebravink pastel charcoal bleekrug grijs man",null,"02",3]
[5036006,"Zebravink pastel charcoal bleekrug grijs pop",null,"02",3]
[5036007,"Zebravink pastel charcoal bleekrug bruin man",null,"02",3]
[5036008,"Zebravink pastel charcoal bleekrug bruin pop",null,"02",3]
[5036009,"Zebravink pastel charcoal masker grijs man",null,"02",3]
[5036010,"Zebravink pastel charcoal masker bruin man",null,"02",3]
[5037001,"Zebravink pastel zwartwang zwartborst grijs man",null,"02",3]
[5037002,"Zebravink pastel zwartwang zwartborst grijs pop",null,"02",3]
[5037003,"Zebravink pastel zwartwang zwartborst bruin man",null,"02",3]
[5037004,"Zebravink pastel zwartwang zwartborst bruin pop",null,"02",3]
[5037005,"Zebravink pastel zwartwang zwartborst bleekrug grijs man",null,"02",3]
[5037006,"Zebravink pastel zwartwang zwartborst bleekrug grijs pop",null,"02",3]
[5037007,"Zebravink pastel zwartwang zwartborst bleekrug bruin man",null,"02",3]
[5037008,"Zebravink pastel zwartwang zwartborst bleekrug bruin pop",null,"02",3]
[5037009,"Zebravink pastel zwartwang zwartborst blackface grijs man",null,"02",3]
[5037010,"Zebravink pastel zwartwang zwartborst blackface grijs pop",null,"02",3]
[5037011,"Zebravink pastel zwartwang zwartborst blackface bruin man",null,"02",3]
[5037012,"Zebravink pastel zwartwang zwartborst blackface bruin pop",null,"02",3]
[5037013,"Zebravink pastel zwartwang zwartborst blackface bleekrug grijs man",null,"02",3]
[5037014,"Zebravink pastel zwartwang zwartborst blackface bleekrug bruin man",null,"02",3]
[5038001,"Zebravink pastel witborst grijs man",null,"02",3]
[5038002,"Zebravink pastel witborst grijs pop",null,"02",3]
[5038003,"Zebravink pastel witborst bruin man",null,"02",3]
[5038004,"Zebravink pastel witborst bruin pop",null,"02",3]
[5039001,"Zebravink topaas grijs man",null,"02",3]
[5039002,"Zebravink topaas grijs pop",null,"02",3]
[5039003,"Zebravink topaas bruin man",null,"02",3]
[5039004,"Zebravink topaas bruin pop",null,"02",3]
[5039005,"Zebravink topaas bleekrug grijs man",null,"02",3]
[5039006,"Zebravink topaas bleekrug grijs pop",null,"02",3]
[5039007,"Zebravink topaas bleekrug bruin man",null,"02",3]
[5040001,"Zebravink witborst grijs man",null,"02",3]
[5040002,"Zebravink witborst grijs pop",null,"02",3]
[5040003,"Zebravink witborst bruin man",null,"02",3]
[5040004,"Zebravink witborst bruin pop",null,"02",3]
[5040005,"Zebravink witborst bleekrug grijs man",null,"02",3]
[5040006,"Zebravink witborst bleekrug grijs pop",null,"02",3]
[5040007,"Zebravink witborst bleekrug bruin man",null,"02",3]
[5040008,"Zebravink witborst masker grijs man",null,"02",3]
[5040009,"Zebravink witborst masker bruin man",null,"02",3]
[5040010,"Zebravink witborst isabel grijs man",null,"02",3]
[5040011,"Zebravink witborst isabel bruin man",null,"02",3]
[5040012,"Zebravink witborst isabel bruin pop",null,"02",3]
[5040013,"Zebravink isabel grijs man",null,"02",3]
[5041001,"Zebravink isabel grijs pop",null,"02",3]
[5041002,"Zebravink isabel bruin man",null,"02",3]
[5041003,"Zebravink isabel bruin pop",null,"02",3]
[5041004,"Zebravink isabel bleekrug grijs man",null,"02",3]
[5041005,"Zebravink isabel bleekrug grijs pop",null,"02",3]
[5041006,"Zebravink wang grijs man",null,"02",3]
[5042001,"Zebravink wang grijs pop",null,"02",3]
[5042002,"Zebravink wang bruin man",null,"02",3]
[5042003,"Zebravink wang bruin pop",null,"02",3]
[5042004,"Zebravink wang bleekrug grijs man",null,"02",3]
[5042005,"Zebravink wang bleekrug grijs pop",null,"02",3]
[5042006,"Zebravink wang bleekrug bruin man",null,"02",3]
[5042007,"Zebravink wang bleekrug bruin pop",null,"02",3]
[5043001,"Zebravink bleekwang grijs man",null,"02",3]
[5043002,"Zebravink bleekwang bruin man",null,"02",3]
[5045001,"Zebravink witwang grijs man",null,"02",3]
[5045002,"Zebravink witwang grijs pop",null,"02",3]
[5046001,"Zebravink gezoomd grijs man",null,"02",3]
[5046002,"Zebravink gezoomd grijs pop",null,"02",3]
[5047001,"Zebravink geelsnavel grijs serie man incl. alle mut",null,"02",3]
[5047002,"Zebravink geelsnavel grijs serie pop incl. alle mut",null,"02",3]
[5047003,"Zebravink geelsnavel bruin serie man incl. alle mut",null,"02",3]
[5047004,"Zebravink geelsnavel bruin serie pop incl. alle mut",null,"02",3]
[5047005,"Zebravink geelsnavel bleekrug grijs serie man incl. alle mut",null,"02",3]
[5047006,"Zebravink geelsnavel bleekrug grijs serie pop incl. alle mut",null,"02",3]
[5047007,"Zebravink geelsnavel bleekrug bruin serie man incl. alle mut",null,"02",3]
[5047008,"Zebravink geelsnavel bleekrug bruin serie pop incl. alle mut",null,"02",3]
[5047009,"Zebravink geelsnavel masker grijs serie man incl. alle mut",null,"02",3]
[5047010,"Zebravink geelsnavel masker grijs serie pop incl. alle mut",null,"02",3]
[5047011,"Zebravink geelsnavel masker bruin serie man incl. alle mut",null,"02",3]
[5047012,"Zebravink geelsnavel masker bruin serie pop incl. alle mut",null,"02",3]
[5047013,"Zebravink geelsnavel wit m/p",null,"02",3]
[5047014,"Zebravink geelsnavel bont m/p",null,"02",3]
[5047015,"Zebravink geelsnavel getekend m/p",null,"02",3]
[5048001,"Zebravink bleeksnavel alle kleurslagen man",null,"02",3]
[5048002,"Zebravink bleeksnavel alle kleurslagen pop",null,"02",3]
[5049001,"Zebravink gekuifd grijs serie inclusief alle mut.man",null,"02",3]
[5049002,"Zebravink gekuifd grijs serie inclusief alle mut.pop",null,"02",3]
[5049003,"Zebravink gekuifd bruin serie inclusief alle mut.man",null,"02",3]
[5049004,"Zebravink gekuifd bruin serie inclusief alle mut.pop",null,"02",3]
[5049005,"Zebravink gekuifd bleekrug grijs serie inclusief alle mut.man",null,"02",3]
[5049006,"Zebravink gekuifd bleekrug grijs serie inclusief alle mut.pop",null,"02",3]
[5049007,"Zebravink gekuifd bleekrug bruin serie inclusief alle mut.man",null,"02",3]
[5049008,"Zebravink gekuifd bleekrug bruin serie inclusief alle mut.pop",null,"02",3]
[5049009,"Zebravink gekuifd masker bruin serie inclusief alle mut.man",null,"02",3]
[5049010,"Zebravink gekuifd masker bruin serie inclusief alle mut.pop",null,"02",3]
[5049011,"Zebravink gekuifd wit m/p",null,"02",3]
[5049012,"Zebravink gekuifd bont m/p",null,"02",3]
[5049013,"Zebravink gekuifd getekend m/p",null,"02",3]
[5049014,"Zebravink gekuifd geelsnavel m/p",null,"02",3]
[5190900,"Zebravink nog niet erkende mut. en comb. m/p",null,"02",3]
[5190999,"Zebravink nieuwe mut. en comb. (in standaard) m/p",null,"02",3]
[5200001,"Timor zebravink wildkleur man",null,"02",3]
[5200002,"Timor zebravink wildkleur pop",null,"02",3]
[5300900,"Timor zebravink nog niet erkende mut. en comb.",null,"02",3]
[5300999,"Timor zebravink nieuwe mut. en comb. (in standaard)",null,"02",3]
[6001001,"Japanse meeuw zwartbruin",null,"02",3]
[6002001,"Japanse meeuw mokkabruin",null,"02",3]
[6003001,"Japanse meeuw roodbruin",null,"02",3]
[6004001,"Japanse meeuw zwartgrijs",null,"02",3]
[6005002,"Japanse meeuw mokkagrijs",null,"02",3]
[6006003,"Japanse meeuw roodgrijs",null,"02",3]
[6007001,"Japanse meeuw SL ino",null,"02",3]
[6007002,"Japanse meeuw SL ino grijs",null,"02",3]
[6008001,"Japanse meeuw pastel mokkabruin",null,"02",3]
[6008002,"Japanse meeuw pastel roodbruin",null,"02",3]
[6008003,"Japanse meeuw pastel mokkagrijs",null,"02",3]
[6008004,"Japanse meeuw pastel roodgrijs",null,"02",3]
[6009001,"Japanse meeuw bleekvleugel mokkabruin",null,"02",3]
[6009002,"Japanse meeuw bleekvleugel roodbruin",null,"02",3]
[6009003,"Japanse meeuw bleekvleugel mokkagrijs",null,"02",3]
[6009004,"Japanse meeuw bleekvleugel roodgrijs",null,"02",3]
[6010001,"Japanse meeuw gepareld zwartbruin",null,"02",3]
[6010002,"Japanse meeuw gepareld zwartgrijs",null,"02",3]
[6011001,"Japanse meeuw getekende witkop zwartbruin",null,"02",3]
[6011002,"Japanse meeuw getekende witkop mokkabruin",null,"02",3]
[6011003,"Japanse meeuw getekende witkop roodbruin",null,"02",3]
[6011004,"Japanse meeuw getekende witkop zwartgrijs",null,"02",3]
[6011005,"Japanse meeuw getekende met oogstreep zwartbruin",null,"02",3]
[6011006,"Japanse meeuw getekende met oogstreep mokkabruin",null,"02",3]
[6011007,"Japanse meeuw getekende met oogstreep roodbruin",null,"02",3]
[6011008,"Japanse meeuw getekende met oogstreep zwartgrijs",null,"02",3]
[6011009,"Japanse meeuw getekende met oogring zwartbruin",null,"02",3]
[6011010,"Japanse meeuw getekende met oogring mokkabruin",null,"02",3]
[6011011,"Japanse meeuw getekende met oogring roodbruin",null,"02",3]
[6011012,"Japanse meeuw getekende met oogring zwartgrijs",null,"02",3]
[6011013,"Japanse meeuw getekende met kap zwartbruin",null,"02",3]
[6011014,"Japanse meeuw getekende met kap mokkabruin",null,"02",3]
[6011015,"Japanse meeuw jetekende met kap roodbruin",null,"02",3]
[6011016,"Japanse meeuw getekende met kap zwartgrijs",null,"02",3]
[6011999,"Japanse meeuw overige getekende alle basis kleurslagen (in standaard)",null,"02",3]
[6012001,"Japanse meeuw wit",null,"02",3]
[6012002,"Japanse meeuw albino",null,"02",3]
[6013001,"Japanse meeuw gekuifd alle kleurslagen in standaard",null,"02",3]
[6100900,"Japanse meeuw nieuwe nog niet erkende mut. en comb.",null,"02",3]
[6100999,"Japanse meeuw nieuwe mut. en comb. (in standaard)",null,"02",3]
[7001001,"Zilverbek wildkleur",null,"02",3]
[7002001,"Zilverbek bruin",null,"02",3]
[7002002,"Zilverbek agaat",null,"02",3]
[7002003,"Zilverbek SL ino",null,"02",3]
[7002004,"Zilverbek pastel",null,"02",3]
[7002005,"Zilverbek grijs",null,"02",3]
[7002006,"Zilverbek topaas",null,"02",3]
[7002007,"Zilverbek opaal",null,"02",3]
[7002008,"Zilverbek donkerbuik",null,"02",3]
[7003001,"Zilverbek bruin-agaat",null,"02",3]
[7003002,"Zilverbek bruingrijs",null,"02",3]
[7004001,"Zilverbek bruinpastel",null,"02",3]
[7004002,"Zilverbek grijspastel",null,"02",3]
[7005001,"Zilverbek SL ino-bruin",null,"02",3]
[7006001,"Zilverbek bruinopaal",null,"02",3]
[7006005,"Zilverbek grijsopaal",null,"02",3]
[7007001,"Zilverbek agaatgrijs",null,"02",3]
[7010001,"Zilverbek donkerbuik bruin",null,"02",3]
[7010002,"Zilverbek donkerbuik agaat",null,"02",3]
[7010003,"Zilverbek donkerbuik bruin-agaat",null,"02",3]
[7010004,"Zilverbek donkerbuik SL ino",null,"02",3]
[7010005,"Zilverbek donkerbuik SL ino-bruin",null,"02",3]
[7010006,"Zilverbek donkerbuik pastel",null,"02",3]
[7010007,"Zilverbek donkerbuik opaal",null,"02",3]
[7010008,"Zilverbek donkerbuik bruinopaal",null,"02",3]
[7010009,"Zilverbek donkerbuik grijs",null,"02",3]
[7010010,"Zilverbek donkerbuik bruingrijs",null,"02",3]
[7010900,"Zilverbek nieuwe nog niet erkende donkerbuik comb.",null,"02",3]
[7010999,"Zilverbek nieuwe donkerbuik comb. (in standaard)",null,"02",3]
[7011999,"Zilverbek geelstaart alle kleurslagen (in standaard)",null,"02",3]
[7100900,"Zilverbek nieuwe nog niet erkende mut. en comb. m/p",null,"02",3]
[7100999,"Zilverbek nieuwe mut. en comb. m/p (in standaard)",null,"02",3]
[7110001,"Loodbek wildkleur",null,"02",3]
[7111001,"Loodbek bruin",null,"02",3]
[7111002,"Loodbek agaat",null,"02",3]
[7111003,"Loodbek SL ino",null,"02",3]
[7111004,"Loodbek pastel",null,"02",3]
[7111005,"Loodbek grijs",null,"02",3]
[7111007,"Loodbek opaal",null,"02",3]
[7111008,"Loodbek donkerbuik wildkleur",null,"02",3]
[7111009,"Loodbek donkerstuit wildkleur",null,"02",3]
[7112001,"Loodbek bruin-agaat",null,"02",3]
[7112002,"Loodbek bruin grijs",null,"02",3]
[7113001,"Loodbek bruinpastel",null,"02",3]
[7113002,"Loodbek grijspastel",null,"02",3]
[7114001,"Loodbek SL ino-bruin",null,"02",3]
[7115001,"Loodbek bruinopaal",null,"02",3]
[7115005,"Loodbek grijsopaal",null,"02",3]
[7120001,"Loodbek donkerbuik bruin",null,"02",3]
[7120005,"Loodbek donkerbuik grijs",null,"02",3]
[7120900,"Loodbek donkerbuik nieuwe nog niet erkende mut. comb.",null,"02",3]
[7120999,"Loodbek donkerbuik nieuwe mut. comb. (in standaard)",null,"02",3]
[7121001,"Loodbek donkerstuit bruin",null,"02",3]
[7121002,"Loodbek donkerstuit agaat",null,"02",3]
[7121003,"Loodbek donkerstuit grijs",null,"02",3]
[7121004,"Loodbek donkerstuit opaal",null,"02",3]
[7122999,"Loodbek geelstaart alle kleurslagen",null,"02",3]
[7200900,"Loodbek nieuwe nog niet erkende mut. en comb. m/p",null,"02",3]
[7200999,"Loodbek nieuwe mut. en comb. m/p (in standaard)",null,"02",3]
[8001001,"Rijstvogel wildkleur (Cites lijst B)",null,"02",3]
[8002002,"Rijstvogel agaat",null,"02",3]
[8002003,"Rijstvogel pastel",null,"02",3]
[8002004,"Rijstvogel mokkabruin",null,"02",3]
[8002005,"Rijstvogel roodbruin",null,"02",3]
[8002006,"Rijstvogel topaas",null,"02",3]
[8002007,"Rijstvogel opaal",null,"02",3]
[8003002,"Rijstvogel agaat pastel",null,"02",3]
[8003003,"Rijstvogel agaat mokkabruin",null,"02",3]
[8003004,"Rijstvogel agaat topaas",null,"02",3]
[8003005,"Rijstvogel agaat opaal",null,"02",3]
[8004002,"Rijstvogel pastel mokkabruin",null,"02",3]
[8004003,"Rijstvogel pastel topaas",null,"02",3]
[8004004,"Rijstvogel pastel opaal",null,"02",3]
[8005002,"Rijstvogel opaal mokkabruin",null,"02",3]
[8006002,"Rijstvogel topaas mokkabruin",null,"02",3]
[8006003,"Rijstvogel topaas opaal",null,"02",3]
[8020001,"Rijstvogel Wit en Albino",null,"02",3]
[8190900,"Rijstvogel nieuwe nog niet erkende mut. en comb. m/p",null,"02",3]
[8190999,"Rijstvogel nieuwe mut. en comb. m/p (in standaard)",null,"02",3]
[8200001,"Timor rijstvogel wildkleur",null,"02",3]
[9001001,"Gouldamadine zwartkop groen paarsborst man",null,"02",3]
[9001002,"Gouldamadine zwartkop groen paarsborst oranjesnavel man",null,"02",3]
[9001003,"Gouldamadine zwartkop groen paarsborst pop",null,"02",3]
[9002001,"Gouldamadine roodkop groen paarsborst man",null,"02",3]
[9002002,"Gouldamadine roodkop groen paarsborst pop",null,"02",3]
[9003001,"Gouldamadine oranjekop groen paarsborst man",null,"02",3]
[9003002,"Gouldamadine oranjekop groen paarsborst pop",null,"02",3]
[9004001,"Gouldamadine zwartkop cinnamon paarsborst man",null,"02",3]
[9004002,"Gouldamadine zwartkop cinnamon paarsborst pop",null,"02",3]
[9004003,"Gouldamadine roodkop cinnamon paarsborst man",null,"02",3]
[9004004,"Gouldamadine roodkop cinnamon paarsborst pop",null,"02",3]
[9004005,"Gouldamadine oranjekop cinnamon paarsborst man",null,"02",3]
[9004006,"Gouldamadine oranjekop cinnamon paarsborst pop",null,"02",3]
[9005001,"Gouldamadine zwartkop groen EF pastel paarsborst man",null,"02",3]
[9005002,"Gouldamadine roodkop groen EF pastel paarsborst man",null,"02",3]
[9005003,"Gouldamadine oranjekop groen EF pastel paarsborst man",null,"02",3]
[9005004,"Gouldamadine zwartkop groen DF pastel paarsborst man",null,"02",3]
[9005005,"Gouldamadine zwartkop groen EF pastel paarsborst pop",null,"02",3]
[9005006,"Gouldamadine roodkop groen DF pastel paarsborst man",null,"02",3]
[9005007,"Gouldamadine roodkop groen EF pastel paarsborst pop",null,"02",3]
[9005008,"Gouldamadine oranjekop groen DF pastel paarsborst man",null,"02",3]
[9005009,"Gouldamadine oranjekop groen EF pastel paarsborst pop",null,"02",3]
[9006001,"Gouldamadine zwartkop geel paarsborst man",null,"02",3]
[9006002,"Gouldamadine zwartkop geel paarsborst pop",null,"02",3]
[9006003,"Gouldamadine roodkop geel paarsborst man",null,"02",3]
[9006004,"Gouldamadine roodkop geel paarsborst pop",null,"02",3]
[9006005,"Gouldamadine oranjekop geel paarsborst man",null,"02",3]
[9006006,"Gouldamadine oranjekop geel paarsborst pop",null,"02",3]
[9007001,"Gouldamadine zwartkop aqua paarsborst man",null,"02",3]
[9007002,"Gouldamadine zwartkop aqua paarsborst pop",null,"02",3]
[9007003,"Gouldamadine roodkop aqua paarsborst man",null,"02",3]
[9007004,"Gouldamadine roodkop aqua paarsborst pop",null,"02",3]
[9007005,"Gouldamadine oranjekop aqua paarsborst man",null,"02",3]
[9007006,"Gouldamadine oranjekop aqua paarsborst pop",null,"02",3]
[9011001,"Gouldamadine zwartkop blauw paarsborst man",null,"02",3]
[9011002,"Gouldamadine zwartkop blauw paarsborst pop",null,"02",3]
[9011003,"Gouldamadine rood/oranjekop blauw paarsborst man",null,"02",3]
[9011004,"Gouldamadine rood/oranjekop blauw paarsborst pop",null,"02",3]
[9011005,"Gouldamadine zwartkop cinnamon blauw paarsborst man",null,"02",3]
[9011006,"Gouldamadine zwartkop cinnamon blauw paarsborst pop",null,"02",3]
[9011007,"Gouldamadine rood/oranjekop cinnamon blauw paarsborst man",null,"02",3]
[9011008,"Gouldamadine rood/oranjekop cinnamon blauw paarsborst pop",null,"02",3]
[9011009,"Gouldamadine zwartkop blauw EF pastel paarsborst man",null,"02",3]
[9011010,"Gouldamadine rood/oranjekop blauw EF pastel paarsborst man",null,"02",3]
[9011011,"Gouldamadine zwartkop blauw DF pastel paarsborst man",null,"02",3]
[9011012,"Gouldamadine zwartkop blauw EF pastel paarsborst pop",null,"02",3]
[9011013,"Gouldamadine rood/oranjekop blauw DF pastel paarsborst man",null,"02",3]
[9011014,"Gouldamadine rood/oranjekop blauw EF pastel paarsborst pop",null,"02",3]
[9020001,"Gouldamadine zwartkop groen lilaborst man",null,"02",3]
[9020002,"Gouldamadine roodkop groen lilaborst man",null,"02",3]
[9020003,"Gouldamadine oranjekop groen lilaborst man",null,"02",3]
[9020004,"Gouldamadine zwartkop cinnamon lilaborst man",null,"02",3]
[9020005,"Gouldamadine roodkop cinnamon lilaborst man",null,"02",3]
[9020006,"Gouldamadine oranjekop cinnamon lilaborst man",null,"02",3]
[9020012,"Gouldamadine zwartkop blauw lilaborst man",null,"02",3]
[9020013,"Gouldamadine rood/oranjekop blauw lilaborst man",null,"02",3]
[9020014,"Gouldamadine zwartkop cinnamon blauw lilaborst",null,"02",3]
[9020015,"Gouldamadine rood/oranjekop cinnamon blauw lilaborst man",null,"02",3]
[9020017,"Gouldamadine zwartkop groen EF pastel lilaborst man",null,"02",3]
[9020018,"Gouldamadine zwartkop groen DF pastel lilaborst man",null,"02",3]
[9020019,"Gouldamadine roodkop groen EF pastel lilaborst man",null,"02",3]
[9020020,"Gouldamadine roodkop groen DF pastel lilaborst man ",null,"02",3]
[9020021,"Gouldamadine oranjekop groen EF pastel lilaborst man",null,"02",3]
[9020022,"Gouldamadine oranjekop groen DF pastel lilaborst man ",null,"02",3]
[9020023,"Gouldamadine zwartkop aqua lilaborst man",null,"02",3]
[9020024,"Gouldamadine roodkop aqua lilaborst man",null,"02",3]
[9020025,"Gouldamadine oranjekop aqua lilaborst man",null,"02",3]
[9020026,"Gouldamadine zwartkop blauw lilaborst man",null,"02",3]
[9020027,"Gouldamadine rood/oranjekop blauw lilaborst man ",null,"02",3]
[9020028,"Gouldamadine zwartkop blauw EF pastel lilaborst man",null,"02",3]
[9020029,"Gouldamadine rood/oranjekop blauw EF pastel lilaborst man",null,"02",3]
[9020030,"Gouldamadine zwartkop blauw DF pastel lilaborst man",null,"02",3]
[9020031,"Gouldamadine rood/oranjekop blauw DF pastel lilaborst man",null,"02",3]
[9021001,"Gouldamadine zwartkop groen witborst man",null,"02",3]
[9021002,"Gouldamadine zwartkop groen witborst oranjesnavel man",null,"02",3]
[9021003,"Gouldamadine zwartkop groen witborst pop",null,"02",3]
[9021004,"Gouldamadine roodkop groen witborst man",null,"02",3]
[9021005,"Gouldamadine roodkop groen witborst pop",null,"02",3]
[9021006,"Gouldamadine oranjekop groen witborst man",null,"02",3]
[9021007,"Gouldamadine oranjekop groen witborst pop",null,"02",3]
[9022001,"Gouldamadine zwartkop cinnamon witborst man",null,"02",3]
[9022002,"Gouldamadine zwartkop cinnamon witborst pop",null,"02",3]
[9022003,"Gouldamadine roodkop cinnamon witborst man",null,"02",3]
[9022004,"Gouldamadine roodkop cinnamon witborst pop",null,"02",3]
[9022005,"Gouldamadine oranjekop cinnamon witborst man",null,"02",3]
[9022006,"Gouldamadine oranjekop cinnamon witborst pop",null,"02",3]
[9022007,"Gouldamadine zwartkop cinnamon blauw witborst man",null,"02",3]
[9022008,"Gouldamadine zwartkop cinnamon blauw witborst pop",null,"02",3]
[9022009,"Gouldamadine rood/oranjekop cinnamon blauw witborst man",null,"02",3]
[9022010,"Gouldamadine rood/oranjekop cinnamon blauw witborst pop",null,"02",3]
[9023001,"Gouldamadine zwartkop groen EF pastel witborst man",null,"02",3]
[9023002,"Gouldamadine roodkop groen EF pastel witborst man",null,"02",3]
[9023003,"Gouldamadine oranjekop groen EF pastel witborst man",null,"02",3]
[9024001,"Gouldamadine zwartkop geel witborst man",null,"02",3]
[9024002,"Gouldamadine zwartkop geel witborst pop",null,"02",3]
[9024003,"Gouldamadine roodkop geel witborst man",null,"02",3]
[9024004,"Gouldamadine roodkop geel witborst pop",null,"02",3]
[9024005,"Gouldamadine oranjekop geel witborst man",null,"02",3]
[9024006,"Gouldamadine oranjekop geel witborst pop",null,"02",3]
[9025001,"Gouldamadine zwartkop aqua witborst man",null,"02",3]
[9025002,"Gouldamadine zwartkop aqua witborst pop",null,"02",3]
[9025003,"Gouldamadine roodkop aqua witborst man",null,"02",3]
[9025004,"Gouldamadine roodkop aqua witborst pop",null,"02",3]
[9025005,"Gouldamadine oranjekop aqua witborst man",null,"02",3]
[9025006,"Gouldamadine oranjekop aqua witborst pop",null,"02",3]
[9028001,"Gouldamadine zwartkop blauw witborst man",null,"02",3]
[9028002,"Gouldamadine zwartkop blauw witborst pop",null,"02",3]
[9028003,"Gouldamadine rood/oranjekop blauw witborst man",null,"02",3]
[9028004,"Gouldamadine rood/oranjekop blauw witborst pop",null,"02",3]
[9028005,"Gouldamadine zwartkop blauw EF pastel witborst man",null,"02",3]
[9028006,"Gouldamadine rood/oranjekop blauw EF pastel witborst man",null,"02",3]
[9029001,"Gouldamadine wit witborst alle kopkleuren man",null,"02",3]
[9029002,"Gouldamadine wit witborst alle kopkleuren pop",null,"02",3]
[9030001,"Gouldamadine zwartkop SL ino groen man",null,"02",3]
[9030002,"Gouldamadine zwartkop SL ino groen pop",null,"02",3]
[9030003,"Gouldamadine roodkop SL ino groen man",null,"02",3]
[9030004,"Gouldamadine roodkop SL ino groen pop",null,"02",3]
[9030005,"Gouldamadine oranjekop SL ino groen man",null,"02",3]
[9030006,"Gouldamadine oranjekop SL ino groen pop",null,"02",3]
[9030007,"Gouldamadine SL ino blauw man",null,"02",3]
[9030008,"Gouldamadine SL ino blauw pop",null,"02",3]
[9031001,"Gouldamadine zwartkop cinnamon-ino man",null,"02",3]
[9031002,"Gouldamadine zwartkop cinnamon-ino pop ",null,"02",3]
[9031003,"Gouldamadine roodkop cinnamon-ino man",null,"02",3]
[9031004,"Gouldamadine roodkop cinnamon-ino pop",null,"02",3]
[9031005,"Gouldamadine oranjekop cinnamon-ino man",null,"02",3]
[9031006,"Gouldamadine oranjekop cinnamon-ino pop",null,"02",3]
[9031070,"Gouldamadine zwartkop cinnamon-ino blauw man",null,"02",3]
[9031071,"Gouldamadine zwartkop cinnamon-ino blauw pop",null,"02",3]
[9031072,"Gouldamadine roodkop/oranjekop cinnamon-ino blauw man",null,"02",3]
[9031073,"Gouldamadine roodkop/oranjekop cinnamon-ino blauw pop",null,"02",3]
[9190900,"Gouldamadine nieuwe nog niet erkende mut. en comb. m/p",null,"02",3]
[9190999,"Gouldamadine nieuwe mut. en comb. m/p (in standaard)",null,"02",3]
[10001001,"Gordelgrasvink wildkleur",null,"02",3]
[10002001,"Gordelgrasvink bruin",null,"02",3]
[10002002,"Gordelgrasvink mokkabruin",null,"02",3]
[10002003,"Gordelgrasvink grijs",null,"02",3]
[10002004,"Gordelgrasvink bruingrijs",null,"02",3]
[10002005,"Gordelgrasvink mokkagrijs",null,"02",3]
[10002006,"Gordelgrasvink SL ino",null,"02",3]
[10002007,"Gordelgrasvink SL ino-bruin",null,"02",3]
[10002900,"Gordelgrasvink nieuwe nog niet erkende mut. en comb. m/p",null,"02",3]
[10002999,"Gordelgrasvink nieuwe mut. en comb. m/p (in standaard)",null,"02",3]
[10003001,"Zwartstuit gordelgrasvink wildkleur",null,"02",3]
[10003900,"Zwartstuit gordelgrasvink nieuwe nog niet erkende mut. en comb. m/p",null,"02",3]
[10003999,"Zwartstuit gordelgrasvink nieuwe mut. en comb. m/p (in standaard)",null,"02",3]
[10005001,"Geelsnavel spitsstaartamadine wildkleur",null,"02",3]
[10006001,"Geelsnavel spitsstaartamadine bruin",null,"02",3]
[10006002,"Geelsnavel spitsstaartamadine mokkabruin",null,"02",3]
[10006003,"Geelsnavel spitsstaartamadine roodbruin",null,"02",3]
[10006004,"Geelsnavel spitsstaartamadine grijs",null,"02",3]
[10006005,"Geelsnavel spitsstaartamadine bruingrijs",null,"02",3]
[10006006,"Geelsnavel spitsstaartamadine mokkagrijs",null,"02",3]
[10006007,"Geelsnavel spitsstaartamadine SL ino",null,"02",3]
[10006008,"Geelsnavel spitsstaartamadine SL ino-bruin",null,"02",3]
[10006009,"Geelsnavel spitsstaartamadine SL ino grijs",null,"02",3]
[10006900,"Geelsnavel spitsstaartamadine nieuwe nog niet erkende mut. en comb. m/p",null,"02",3]
[10006999,"Geelsnavel spitsstaartamadine nieuwe mut. en comb. m/p (in standaard)",null,"02",3]
[10007001,"Roodsnavel spitsstaartamadine wildkleur",null,"02",3]
[10008001,"Roodsnavel spitsstaartamadine bruin",null,"02",3]
[10008002,"Roodsnavel spitsstaartamadine mokkabruin",null,"02",3]
[10008003,"Roodsnavel spitsstaartamadine roodbruin",null,"02",3]
[10008004,"Roodsnavel spitsstaartamadine grijs",null,"02",3]
[10008005,"Roodsnavel spitsstaartamadine bruingrijs",null,"02",3]
[10008006,"Roodsnavel spitsstaartamadine mokkagrijs",null,"02",3]
[10008007,"Roodsnavel spitsstaartamadine SL ino",null,"02",3]
[10008008,"Roodsnavel spitsstaartamadine SL ino-bruin",null,"02",3]
[10008009,"Roodsnavel spitsstaartamadine SL ino grijs",null,"02",3]
[10008900,"Roodsnavel spitsstaartamadine nieuwe nog niet erkende mut. en comb. m/p",null,"02",3]
[10008999,"Roodsnavel spitsstaartamadine nieuwe mut. en comb. m/p (in standaard)",null,"02",3]
[10009001,"Bleeksnavel spitsstaartamadine wildkleur",null,"02",3]
[10009002,"Bleeksnavel spitsstaartamadine bruin",null,"02",3]
[10009003,"Bleeksnavel spitsstaartamadine mokkabruin",null,"02",3]
[10009004,"Bleeksnavel spitsstaartamadine roodbruin",null,"02",3]
[10009005,"Bleeksnavel spitsstaartamadine grijs",null,"02",3]
[10009006,"Bleeksnavelspitsstaartamadine SL ino",null,"02",3]
[10009900,"Bleeksnavelspitsstaartamadine nieuwe nog niet erkende mut. en comb. m/p",null,"02",3]
[10009999,"Bleeksnavelspitsstaartamadine nieuwe mut. en comb. m/p (in standaard)",null,"02",3]
[10010001,"Maskeramadine wildkleur",null,"02",3]
[10010900,"Maskeramadine nieuwe niet erkende mut. en comb. m/p",null,"02",3]
[10010999,"Maskeramadine nieuwe mut. en comb. m/p (in standaard)",null,"02",3]
[10011001,"Witoormaskeramadine wildkleur",null,"02",3]
[10011900,"Witoormaskeramadine nieuwe nog niet erkende mut. en comb. m/p",null,"02",3]
[10011999,"Witoormaskeramadine nieuwe mut. en comb. m/p (in standaard)",null,"02",3]
[10012001,"Bichenow astrilde wildkleur",null,"02",3]
[10013001,"Bichenow astrilde bruin",null,"02",3]
[10013900,"Bichenow astrilde nieuwe nog niet erkende mut. en comb. m/p",null,"02",3]
[10013999,"Bichenow astrilde nieuwe mut. en comb. m/p (in standaard)",null,"02",3]
[10014001,"Zwartstuit bichenow astrilde wildkleur",null,"02",3]
[10015001,"Zwartstuit bichenow astrilde bruin",null,"02",3]
[10015900,"Zwartstuit bichenow nieuwe nog niet erkende mut. en comb. m/p",null,"02",3]
[10015999,"Zwartstuit bichenow nieuwe mut. en comb. m/p (in standaard)",null,"02",3]
[10016001,"Ceresamadine wildkleur man",null,"02",3]
[10016002,"Ceresamadine wildkleur pop",null,"02",3]
[10017001,"Ceresamadine bruin man",null,"02",3]
[10017002,"Ceresamadine bruin pop",null,"02",3]
[10017003,"Ceresamadine agaat man",null,"02",3]
[10017004,"Ceresamadine agaat pop",null,"02",3]
[10017005,"Ceresamadine bruin-agaat man",null,"02",3]
[10017006,"Ceresamadine bruin-agaat pop",null,"02",3]
[10017900,"Ceresamadine nieuwe nog niet erkende mut. en comb. m/p",null,"02",3]
[10017999,"Ceresamadine nieuwe mut. en comb. m/p (in standaard)",null,"02",3]
[10018001,"Diamantvink roodsnavel wildkleur",null,"02",3]
[10019001,"Diamantvink roodsnavel bruin",null,"02",3]
[10019002,"Diamantvink roodsnavel pastel",null,"02",3]
[10019003,"Diamantvink roodsnavel bruinpastel",null,"02",3]
[10019004,"Diamantvink roodsnavel overgoten",null,"02",3]
[10019005,"Diamantvink roodsnavel overgoten bruin",null,"02",3]
[10019900,"Diamantvink roodsnavel nieuwe nog niet erkende mut. en comb. m/p",null,"02",3]
[10019999,"Diamantvink roodsnavel nieuwe mut. en comb. m/p (in standaard)",null,"02",3]
[10020001,"Diamantvink oranjesnavel",null,"02",3]
[10020002,"Diamantvink oranjesnavel bruin",null,"02",3]
[10020003,"Diamantvink oranjesnavel pastel",null,"02",3]
[10020004,"Diamantvink oranjesnavel bruinpastel",null,"02",3]
[10020005,"Diamantvink oranjesnavel overgoten",null,"02",3]
[10020006,"Diamantvink oranjesnavel overgoten bruin",null,"02",3]
[10020900,"Diamantvink oranjesnavel nieuwe nog niet erkende mut. en comb. m/p",null,"02",3]
[10020999,"Diamantvink oranjesnavel nieuwe mut. en comb. m/p (in standaard)",null,"02",3]
[10021001,"Binsenastrilde wildkleur man",null,"02",3]
[10021002,"Binsenastrilde wildkleur pop",null,"02",3]
[10022001,"Binsenastrilde cinnamon man",null,"02",3]
[10022002,"Binsenastrilde cinnamon pop",null,"02",3]
[10022003,"Binsenastrilde pastel man",null,"02",3]
[10022004,"Binsenastrilde pastel pop",null,"02",3]
[10022007,"Binsenastrilde overgoten man",null,"02",3]
[10022008,"Binsenastrilde overgoten pop",null,"02",3]
[10022900,"Binsenastrilde nieuwe nog niet erkende mut. en comb. m/p",null,"02",3]
[10022999,"Binsenastrilde nieuwe mut. en comb. m/p (in standaard)",null,"02",3]
[10023001,"Binsenastrilde oranjesnavel man",null,"02",3]
[10023002,"Binsenastrilde oranjesnavel pop",null,"02",3]
[10023003,"Binsenastrilde oranjesnavel cinnamon man",null,"02",3]
[10023004,"Binsenastrilde oranjesnavel cinnamon pop",null,"02",3]
[10023005,"Binsenastrilde oranjesnavel pastel man",null,"02",3]
[10023006,"Binsenastrilde oranjesnavel pastel pop",null,"02",3]
[10023007,"Binsenastrilde oranjesnavel overgoten man",null,"02",3]
[10023008,"Binsenastrilde oranjesnavel overgoten pop",null,"02",3]
[10023900,"Binsenastrilde oranjesnavel nieuwe nog niet erkende mut. en comb. m/p",null,"02",3]
[10023999,"Binsenastrilde oranjesnavel nieuwe mut. en comb. m/p (in standaard)",null,"02",3]
[10024001,"Zwartbuikzonastrilde wildkleur man",null,"02",3]
[10024002,"Zwartbuikzonastrilde wildkleur pop",null,"02",3]
[10024003,"Witbuikzonastrilde wildkleur man",null,"02",3]
[10024004,"Witbuikzonastrilde wildkleur pop",null,"02",3]
[10025001,"Zwartbuikzonastrilde oranjesnavel man",null,"02",3]
[10025002,"Zwartbuikzonastrilde oranjesnavel pop",null,"02",3]
[10025900,"Zwartbuik zonastrilde nieuwe nog niet erkende mut. en comb. m/p",null,"02",3]
[10025999,"Zwartbuik zonastrilde nieuwe mut. en comb. m/p (in standaard)",null,"02",3]
[10026900,"Witbuik zonastrilde nieuwe nog niet erkende mut. en comb. m/p",null,"02",3]
[10026999,"Witbuik zonastrilde nieuwe mut. en comb. m/p (in standaard)",null,"02",3]
[10027001,"Emblema picta wildkleur man",null,"02",3]
[10027002,"Emblema picta wildkleur pop",null,"02",3]
[10028001,"Emblema picta oranjesnavel man",null,"02",3]
[10028002,"Emblema picta oranjesnavel pop",null,"02",3]
[10028900,"Emblema picta nieuwe nog niet erkende mut. en comb. m/p",null,"02",3]
[10028999,"Emblema picta nieuwe mut. en comb. m/p (in standaard)",null,"02",3]
[10029001,"Dorn astrilde wildkleur",null,"02",3]
[10030001,"Dorn astrilde oranjesnavel",null,"02",3]
[10030900,"Dorn astrilde nieuwe nog niet erkende mut. en comb. m/p",null,"02",3]
[10030999,"Dorn astrilde nieuwe mut. en comb. m/p (in standaard)",null,"02",3]
[11001001,"Driekleurpapegaaiamadine wildkleur",null,"02",3]
[11002001,"Driekleurpapegaaiamadine cinnamon",null,"02",3]
[11002002,"Driekleurpapegaaiamadine aqua",null,"02",3]
[11002003,"Driekleurpapegaaiamadine SL ino",null,"02",3]
[11002004,"Driekleurpapegaaiamadine gele zwartoog",null,"02",3]
[11002005,"Driekleurpapegaaiamadine cinnamon aqua",null,"02",3]
[11002006,"Driekleurpapegaaiamadine cinnamon gele zwartoog",null,"02",3]
[11002900,"Driekleurpapegaaiamadine nieuwe nog niet erkende mut. en comb. m/p",null,"02",3]
[11002999,"Driekleurpapegaaiamadine nieuwe mut. en comb. m/p (in standaard)",null,"02",3]
[11003001,"Roodkoppapegaaiamadine wildkleur",null,"02",3]
[11004001,"Roodkoppapegaaiamadine aqua",null,"02",3]
[11004002,"Roodkoppapegaaiamadine SL ino",null,"02",3]
[11004003,"Roodkoppapegaaiamadine SL ino-aqua",null,"02",3]
[11004004,"Roodkoppapegaaiamadine getekend groen",null,"02",3]
[11004005,"Roodkoppapegaaiamadine getekend aqua",null,"02",3]
[11004900,"Roodkoppapegaaiamadine nieuwe nog niet erkende mut. en comb. m/p",null,"02",3]
[11004999,"Roodkoppapegaaiamadine nieuwe mut. en comb. m/p (in standaard)",null,"02",3]
[11005001,"Forbes papegaaiamadine wildkleur man",null,"02",3]
[11005002,"Forbes papegaaiamadine wildkleur pop",null,"02",3]
[11006001,"Forbes papegaaiamadine aqua man",null,"02",3]
[11006002,"Forbes papegaaiamadine aqua pop",null,"02",3]
[11006900,"Forbes papegaaiamadine nieuwe nog niet erkende mut. en comb. m/p",null,"02",3]
[11006999,"Forbes papegaaiamadine nieuwe mut. en comb. m/p (in standaard)",null,"02",3]
[11007001,"Peales papegaaiamadine wildkleur",null,"02",3]
[11008001,"Peales papegaaiamadine aqua",null,"02",3]
[11008900,"Peales papegaaiamadine nieuwe nog niet erkende mut. en comb. m/p",null,"02",3]
[11008999,"Peales papegaaiamadine nieuwe mut. en comb. m/p (in standaard)",null,"02",3]
[11009001,"Coloria papegaaiamadine wildkleur",null,"02",3]
[11010001,"Coloria papegaaiamadine aqua",null,"02",3]
[11010900,"Coloria papegaaiamadine nieuwe nog niet erkende mut. en comb. m/p",null,"02",3]
[11010999,"Coloria papegaaiamadine nieuwe mut. en comb. m/p (in standaard)",null,"02",3]
[11011001,"Bamboe papegaaiamadine wildkleur",null,"02",3]
[11011002,"Lombok papegaaiamadine wildkleur",null,"02",3]
[11011900,"Bamboe en Lombok papegaaiamadine nieuwe nog niet erkende mut. en comb. m/p",null,"02",3]
[11011999,"Bamboe en Lombok papegaaiamadine nieuwe mut. en comb. m/p (in standaard)",null,"02",3]
[11012001,"Indische nonpareil wildkleur",null,"02",3]
[11013001,"Indische nonpareil geelbuik",null,"02",3]
[11013002,"Indische nonpareil roodbuik aqua",null,"02",3]
[11013003,"Indische nonpareil geelbuik aqua",null,"02",3]
[11013900,"Indische nonpareil nieuwe nog niet erkende mut. en comb. m/p",null,"02",3]
[11013999,"Indische nonpareil nieuwe mut. en comb. m/p (in standaard)",null,"02",3]
[11100999,"Papegaaiamadine niet genoemde soorten wildkleur",null,"02",3]
[12020001,"Bruinborstrietvink wildkleur",null,"02",3]
[12021001,"Dwergrietvink wildkleur",null,"02",3]
[12021002,"Witborstrietvink wildkleur man",null,"02",3]
[12021003,"Witborstrietvink wildkleur pop",null,"02",3]
[12021004,"Gele rietvink wildkleur",null,"02",3]
[12021005,"Zwartborstrietvink wildkleur",null,"02",3]
[12021999,"Rietvinken  niet genoemde soorten",null,"02",3]
[12022001,"Bruinborstrietvink mokkabruin",null,"02",3]
[12022002,"Bruinborstrietvink roodbruin",null,"02",3]
[12022003,"Bruinborstrietvink SL ino",null,"02",3]
[12022004,"Bruinborstrietvink grijs",null,"02",3]
[12022050,"Bruinborstrietvink gekuifd alle kleurslagen genoemd in standaard",null,"02",3]
[12022900,"Bruinborstrietvinken nieuwe nog niet erkende mut. en comb. m/p",null,"02",3]
[12022999,"Bruinborstrietvinken nieuwe mut. en comb. m/p (in standaard)",null,"02",3]
[12024001,"Dwergrietvink roodbruin",null,"02",3]
[12024900,"Dwergrietvinken nieuwe nog niet erkende mut. en comb. m/p",null,"02",3]
[12024999,"Dwergrietvinken nieuwe mut. en comb. m/p (in standaard)",null,"02",3]
[12025900,"Overige rietvinken nieuwe nog niet erkende mut. en comb. m/p",null,"02",3]
[12025999,"Overige rietvinken nieuwe mut. en comb. m/p (in standaard)",null,"02",3]
[12026001,"Driekleurnon wildkleur",null,"02",3]
[12026002,"Zwartkopnon wildkleur",null,"02",3]
[12026003,"Chinese zwartkopnon wildkleur",null,"02",3]
[12026004,"Bruinkopnon wildkleur",null,"02",3]
[12026005,"Schildnon wildkleur",null,"02",3]
[12026006,"Witkopnon wildkleur",null,"02",3]
[12026007,"Bleekkopnon wildkleur",null,"02",3]
[12026008,"Witschedelnon wildkleur",null,"02",3]
[12026009,"Diksnavelnon wildkleur",null,"02",3]
[12026010,"Hadesnon wildkleur",null,"02",3]
[12026011,"Vijfkleurennon wildkleur",null,"02",3]
[12026012,"Prachtnon wildkleur",null,"02",3]
[12026999,"Nonnen wildkleur niet genoemde soorten",null,"02",3]
[12027001,"Witkopnon mokkabruin",null,"02",3]
[12027002,"Witkopnon roodbruin",null,"02",3]
[12027003,"Witkopnon SL ino",null,"02",3]
[12027004,"Driekleurnon roodbruin",null,"02",3]
[12027005,"Hadesnon mokkabruin",null,"02",3]
[12027900,"Nonnen nieuwe niet erkende mut. en comb. m/p",null,"02",3]
[12027999,"Nonnen nieuwe mut. en comb. m/p (in standaard)",null,"02",3]
[12028001,"Spitsstaartbronzeman wildkleur",null,"02",3]
[12028002,"Javabronzeman wildkleur",null,"02",3]
[12028003,"Molukkenbronzeman wildkleur",null,"02",3]
[12028004,"Borneobronzeman wildkleur",null,"02",3]
[12028005,"Treurbronzeman wildkleur",null,"02",3]
[12028006,"Geparelde bronzeman wildkleur",null,"02",3]
[12028999,"Bronzemannen niet genoemde soorten",null,"02",3]
[12029001,"Spitsstaartbronzeman mokkabruin",null,"02",3]
[12029002,"Spitsstaartbronzeman roodbruin",null,"02",3]
[12029003,"Spitsstaartbronzeman SL ino",null,"02",3]
[12029004,"Spitsstaartbronzeman pastel",null,"02",3]
[12029005,"Spitsstaartbronzeman grijs",null,"02",3]
[12029006,"Spitsstaartbronzeman pastelgrijs",null,"02",3]
[12029900,"Spitsstaartbronzeman nieuwe niet erkende mut. en comb. m/p",null,"02",3]
[12029999,"Spitsstaartbronzeman nieuwe mut. en comb. m/p (in standaard)",null,"02",3]
[12030001,"Molukkenbronzeman roodbruin",null,"02",3]
[12030002,"Molukkenbronzeman SL ino",null,"02",3]
[12030003,"Molukkenbronzeman pastel",null,"02",3]
[12030004,"Molukkenbronzeman grijs",null,"02",3]
[12030005,"Molukkenbronzeman pastelgrijs",null,"02",3]
[12030900,"Molukkenbronzeman nieuwe niet erkende mut. en comb. m/p",null,"02",3]
[12030999,"Molukkenbronzeman nieuwe mut. en comb. m/p (in standaard)",null,"02",3]
[12031001,"Borneobronzeman roodbruin",null,"02",3]
[12031002,"Borneobronzeman SL ino",null,"02",3]
[12031003,"Borneobronzeman pastel",null,"02",3]
[12031004,"Borneobronzeman grijs",null,"02",3]
[12031005,"Borneobronzeman pastelgrijs",null,"02",3]
[12031900,"Borneobronzeman  nieuwe niet erkende mut. en comb. m/p",null,"02",3]
[12031999,"Borneobronzeman nieuwe mut. en comb. m/p (in standaard)",null,"02",3]
[12032001,"Javabronzeman pastel",null,"02",3]
[12032900,"Javabronzeman nieuwe niet erkende mut. en comb. m/p",null,"02",3]
[12032999,"Javabronzeman nieuwe mut. en comb. m/p (in standaard)",null,"02",3]
[12033001,"Indische muskaatvink wildkleur",null,"02",3]
[12033002,"Javaanse muskaatvink wildkleur",null,"02",3]
[12033003,"Chinese muskaatvink wildkleur",null,"02",3]
[12034001,"Indische muskaatvink pastel",null,"02",3]
[12034900,"Indische muskaatvink nieuwe niet erkende mut. en comb. m/p",null,"02",3]
[12034999,"Indische muskaatvink nieuwe mut. en comb. m/p (in standaard)",null,"02",3]
[12037900,"Muskaatvinken nieuwe niet erkende mut. en comb. m/p",null,"02",3]
[12037999,"Muskaatvinken nieuwe mut. en comb. m/p (in standaard)",null,"02",3]
[12038001,"Dwergekstertje wildkleur",null,"02",3]
[12039900,"Dwergekstertje nieuwe niet erkende mut. en comb. m/p",null,"02",3]
[12039999,"Dwergekstertje nieuwe mut. en comb. m/p (in standaard)",null,"02",3]
[13001001,"Mexicaanse roodmus wildkleur man",null,"02",3]
[13001002,"Mexicaanse roodmus wildkleur pop",null,"02",3]
[13002010,"Mexicaanse roodmus topaas man",null,"02",3]
[13002011,"Mexicaanse roodmus topaas pop",null,"02",3]
[13002012,"Mexicaanse roodmus phaeo man",null,"02",3]
[13002013,"Mexicaanse roodmus phaeo pop",null,"02",3]
[13002014,"Mexicaanse roodmus NSL ino man",null,"02",3]
[13002015,"Mexicaanse roodmus NSL ino type geel man",null,"02",3]
[13002016,"Mexicaanse roodmus NSL ino pop",null,"02",3]
[13002017,"Mexicaanse roodmus opaal man",null,"02",3]
[13002018,"Mexicaanse roodmus opaal  type geel man",null,"02",3]
[13002019,"Mexicaanse roodmus opaal pop",null,"02",3]
[13002020,"Mexicaanse roodmus EF pastel man",null,"02",3]
[13002021,"Mexicaanse roodmus EF pastel pop",null,"02",3]
[13002900,"Mexicaanse roodmus nieuwe niet erkende mut. en comb. m/p",null,"02",3]
[13002999,"Mexicaanse roodmus nieuwe mut. en comb. m/p (in standaard)",null,"02",3]
[13003001,"Magellaansijs wildkleur man",null,"02",3]
[13003002,"Magellaansijs wildkleur pop",null,"02",3]
[13004001,"Magellaansijs bruin man",null,"02",3]
[13004002,"Magellaansijs bruin pop",null,"02",3]
[13004003,"Magellaansijs agaat man",null,"02",3]
[13004004,"Magellaansijs agaat pop",null,"02",3]
[13004005,"Magellaansijs bruin-agaat man",null,"02",3]
[13004006,"Magellaansijs bruin-agaat pop",null,"02",3]
[13004007,"Magellaansijs EF pastel man",null,"02",3]
[13004008,"Magellaansijs EF pastel pop",null,"02",3]
[13004009,"Magellaansijs EF pastel bruin man",null,"02",3]
[13004010,"Magellaansijs EF pastel bruin pop",null,"02",3]
[13004011,"Magellaansijs EF pastel agaat man",null,"02",3]
[13004012,"Magellaansijs EF pastel agaat pop",null,"02",3]
[13004013,"Magellaansijs DF pastel wildkleur man",null,"02",3]
[13004014,"Magellaansijs DF pastel wildkleur pop",null,"02",3]
[13004020,"Magellaansijs topaas man",null,"02",3]
[13004021,"Magellaansijs topaas pop",null,"02",3]
[13004022,"Magellaansijs NSL ino man",null,"02",3]
[13004023,"Magellaansijs NSL ino pop",null,"02",3]
[13004900,"Magellaansijs nieuwe niet erkende mut. en comb. m/p",null,"02",3]
[13004999,"Magellaansijs nieuwe mut. en comb. m/p (in standaard)",null,"02",3]
[13005001,"Kapoetsensijs wildkleur man",null,"02",3]
[13005002,"Kapoetsensijs wildkleur pop",null,"02",3]
[13006001,"Kapoetsensijs bruin man",null,"02",3]
[13006002,"Kapoetsensijs bruin pop",null,"02",3]
[13006003,"Kapoetsensijs agaat man",null,"02",3]
[13006004,"Kapoetsensijs agaat pop",null,"02",3]
[13006005,"Kapoetsensijs bruin-agaat man",null,"02",3]
[13006006,"Kapoetsensijs bruin-agaat pop",null,"02",3]
[13006007,"Kapoetsensijs EF pastel man",null,"02",3]
[13006008,"Kapoetsensijs EF pastel pop",null,"02",3]
[13006009,"Kapoetsensijs EF pastel bruin man",null,"02",3]
[13006010,"Kapoetsensijs EF pastel bruin pop",null,"02",3]
[13006011,"Kapoetsensijs EF pastel agaat man",null,"02",3]
[13006012,"Kapoetsensijs EF pastel agaat pop",null,"02",3]
[13006013,"Kapoetsensijs DF pastel wildkleur man",null,"02",3]
[13006014,"Kapoetsensijs DF pastel wildkleur pop",null,"02",3]
[13006020,"Kapoetsensijs topaas man",null,"02",3]
[13006021,"Kapoetsensijs topaas pop",null,"02",3]
[13006022,"Kapoetsensijs EF pastel topaas man",null,"02",3]
[13006023,"Kapoetsensijs EF pastel topaas pop",null,"02",3]
[13006900,"Kapoetsensijs nieuwe niet erkende mut. en comb. m/p",null,"02",3]
[13006999,"Kapoetsensijs nieuwe mut. en comb. m/p (in standaard)",null,"02",3]
[13007001,"Bandvink wildkleur man",null,"02",3]
[13007002,"Bandvink wildkleur pop",null,"02",3]
[13007003,"Roodkop amadine wildkleur man",null,"02",3]
[13007004,"Roodkop amadine wildkleur pop",null,"02",3]
[13007005,"Ekstertje wildkleur",null,"02",3]
[13007006,"Reuzen ekstertje wildkleur",null,"02",3]
[13007007,"Glans ekstertje wildkleur",null,"02",3]
[13007008,"Zwartrug ekstertje wildkleur",null,"02",3]
[13007009,"Bruinrug ekstertje wildkleur",null,"02",3]
[13007020,"Parelhalsamadine",null,"02",3]
[13007999,"Amadina en ekstertjes niet genoemde soorten",null,"02",3]
[13008900,"Amadina en ekstertjes niet erkende mut",null,"02",3]
[13008999,"Amadine en ekstetrjes nieuwe nutanten (in standaard)",null,"02",3]
[13009001,"Bandvink bruin man",null,"02",3]
[13009002,"Bandvink bruin pop",null,"02",3]
[13009005,"Bandvink pastel man",null,"02",3]
[13009006,"Bandvink pastel pop",null,"02",3]
[13009007,"Bandvink grijs man",null,"02",3]
[13009008,"Bandvink grijs pop",null,"02",3]
[13009009,"Bandvink opaal man",null,"02",3]
[13009010,"Bandvink opaal pop",null,"02",3]
[13009011,"Bandvink NSL ino man",null,"02",3]
[13009012,"Bandvink NSL ino pop",null,"02",3]
[13009900,"Bandvink nieuwe niet erkende mut. en comb. m/p",null,"02",3]
[13009999,"Bandvink nieuwe mut. en comb. m/p (in standaard)",null,"02",3]
[13010001,"Bandvink oranjeband man",null,"02",3]
[13010002,"Bandvink oranjeband bruin man",null,"02",3]
[13010003,"Bandvink oranjeband pastel man",null,"02",3]
[13010004,"Bandvink oranjeband grijs man",null,"02",3]
[13010005,"Bandvink oranjeband opaal man",null,"02",3]
[13010006,"Bandvink oranjeband NSL ino man",null,"02",3]
[13010900,"Bandvink oranjeband nieuwe niet erkende mut. en comb. m/p",null,"02",3]
[13010999,"Bandvink oranjeband nieuwe mut. en comb. m/p (in standaard)",null,"02",3]
[13011001,"Roodkop amadine bruin man",null,"02",3]
[13011002,"Roodkop amadine bruin pop",null,"02",3]
[13011003,"Roodkop amadine grijs man",null,"02",3]
[13011004,"Roodkop amadine grijs pop",null,"02",3]
[13011005,"Roodkop amadine oranjekop man",null,"02",3]
[13011006,"Roodkop amadine oranjekop bruin man",null,"02",3]
[13011007,"Roodkop amadine oranjekop grijs man",null,"02",3]
[13011900,"Roodkop amadine nieuwe niet erkende mut. en comb. m/p",null,"02",3]
[13011999,"Roodkop amadine nieuwe mut. en comb. m/p (in standaard)",null,"02",3]
[13012001,"Goudbuikje man",null,"02",3]
[13012002,"Goudbuikje pop",null,"02",3]
[13012003,"Clarks goudbuikje man",null,"02",3]
[13012004,"Clarks goudbuikje pop",null,"02",3]
[13012005,"Rode tijgervink man",null,"02",3]
[13012006,"Rode tijgervink pop",null,"02",3]
[13012007,"Kwartelastrilde m/p",null,"02",3]
[13012008,"Patrijsastrilde m/p",null,"02",3]
[13012009,"Reichenow bergastrilde m/p",null,"02",3]
[13012999,"Overige amandava, cryptospiza en ortygospiza soorten wildkleur m/p",null,"02",3]
[13013900,"Niet genoemde mutanten Amandava soorten, kwartel- en bergastrilden",null,"02",3]
[13013999,"Niet genoemde mut. Amandava soorten, kwartel- en bergastrilden (in standaard)",null,"02",3]
[13014001,"Angola blauwfazantje m/p",null,"02",3]
[13014002,"Blauwfazantje wildkleur man",null,"02",3]
[13014003,"Blauwfazantje wildkleur pop",null,"02",3]
[13014004,"Blauwkopblauwfazantje man",null,"02",3]
[13014005,"Blauwkopblauwfazantje pop",null,"02",3]
[13014006,"Granaat astrilde man",null,"02",3]
[13014007,"Granaat astrilde pop",null,"02",3]
[13014008,"Purpergranaat astrilde man",null,"02",3]
[13014009,"Purpergranaat astrilde pop",null,"02",3]
[13014010,"Blauwgrijsroodstaartje m/p",null,"02",3]
[13014011,"Blauwgrijszwartstaartje m/p",null,"02",3]
[13014012,"Cinderella blauwgrijszwartstaartje m/p",null,"02",3]
[13014013,"Delamerei elfen astrilde m/p",null,"02",3]
[13014014,"Elfenastrilde ,/p",null,"02",3]
[13014015,"Feeen astrilde m/p",null,"02",3]
[13014016,"Nonastrilde m/p",null,"02",3]
[13014017,"Zwartkap astrilde m/p",null,"02",3]
[13014999,"Uraeginthus en estrilda soorten wildkleur m/p niet genoemd",null,"02",3]
[13015001,"Blauwfazantje oranjewang man",null,"02",3]
[13015002,"Blauwfazantje pastel man",null,"02",3]
[13015003,"Blauwfazantje pastel pop",null,"02",3]
[13015004,"Blauwfazantje overgoten man",null,"02",3]
[13015005,"Blauwfazantje overgoten pop",null,"02",3]
[13015006,"Blauwkopblauwfazantje pastel man",null,"02",3]
[13015007,"Blauwkopblauwfazantje pastel pop",null,"02",3]
[13015008,"Blauwkopblauwfazantje overgoten man",null,"02",3]
[13015009,"Blauwkopblauwfazantje overgoten pop",null,"02",3]
[13015010,"Granaatastrilde oranjesnavel man",null,"02",3]
[13015011,"Granaatastrilde oranjesnavel pop",null,"02",3]
[13015900,"Blauwfazant en Granaatastrilde nieuwe niet erkende mut. en comb. m/p",null,"02",3]
[13015999,"Blauwfazant en Granaatastrilde nieuwe mut. en comb. m/p (in standaard)",null,"02",3]
[13016001,"Donkerrode amarant m/p",null,"02",3]
[13016002,"Grote puntastrilde m/p",null,"02",3]
[13016003,"Jamesons amarant m/p",null,"02",3]
[13016004,"Kleine puntastrilde m/p",null,"02",3]
[13016005,"Mali amarant m/p",null,"02",3]
[13016006,"Pracht amarant m/p",null,"02",3]
[13016007,"Roze amarant (Jameson vuurvink) m/p",null,"02",3]
[13016008,"Togozwartkeel amarant m/p",null,"02",3]
[13016009,"Vuurvink (senegal amarant) man",null,"02",3]
[13016010,"Vuurvink (senegal amarant) pop",null,"02",3]
[13016011,"Wijnrode amarant m/p",null,"02",3]
[13016012,"Zwartbuikvuurvink man",null,"02",3]
[13016013,"Zwartbuikvuurvink pop",null,"02",3]
[13016014,"Zwartkeel amarant m/p",null,"02",3]
[13016015,"Zwartmasker amarant m/p",null,"02",3]
[13016999,"Lagonosticta niet genoemde soorten m/p",null,"02",3]
[13017900,"Mutanten Lagonosticta soorten",null,"02",3]
[13017999,"Mutanten Lagonosticta soorten (in standaard)",null,"02",3]
[13018001,"Karmozijn astrilde m/p",null,"02",3]
[13018002,"Grote karmozijnastrilde m/p",null,"02",3]
[13018003,"Blauwsnavel astrilde m/p",null,"02",3]
[13018004,"Roodborst zaadkraker m/p",null,"02",3]
[13018005,"Roodkop zaadkraker m/p",null,"02",3]
[13018006,"Witwangmees astrilde m/p",null,"02",3]
[13018999,"Pyrenestes, spermophaga en nesocharis niet genoemde soorten wildkleur m/p",null,"02",3]
[13019900,"Mutanten pyrenestes, spermophaga en nesocharis soorten",null,"02",3]
[13019999,"Mutanten pyrenestes, spermophaga en nesocharis soorten (in standaard)",null,"02",3]
[13020001,"Rode druppelastrilde man",null,"02",3]
[13020002,"Rode druppelastrilde pop",null,"02",3]
[13020003,"Groene druppelastrilde man",null,"02",3]
[13020004,"Groene druppelastrilde pop",null,"02",3]
[13020005,"Schlegel groene druppelastrilde man",null,"02",3]
[13020006,"Schlegel groene druppelastrilde pop",null,"02",3]
[13020007,"Dybowski astrilde m/p",null,"02",3]
[13020008,"Bruine druppelastrilde m/p",null,"02",3]
[13020009,"Aurora astrilde m/p",null,"02",3]
[13020010,"Roodmasker (geelvleugelastrilde) man",null,"02",3]
[13020011,"Roodmasker (geelvleugelastrilde) pop",null,"02",3]
[13020012,"Wiener astrilde man",null,"02",3]
[13020013,"Wiener astrilde pop",null,"02",3]
[13020014,"Melba astrilde man",null,"02",3]
[13020015,"Melba astrilde pop",null,"02",3]
[13020016,"Roodmasker roodvleugel aurora astrilde man",null,"02",3]
[13020017,"Roodmasker roodvleugel aurora astrilde pop",null,"02",3]
[13020999,"Druppel- en gestreepte astrilden niet genoemde soorten wildkleur m/p",null,"02",3]
[13021900,"Mutanten druppel- en gestreepte astrilden",null,"02",3]
[13021999,"Mutanten druppel- en gestreepte astrilden (in standaard)",null,"02",3]
[13022001,"Napoleonnetje m/p",null,"02",3]
[13022002,"Oranje kaakje m/p",null,"02",3]
[13022003,"St Helena fazantje m/p",null,"02",3]
[13022004,"Teugel astrilde m/p",null,"02",3]
[13022005,"Dufresne astrilde man",null,"02",3]
[13022006,"Dufresne astrilde pop",null,"02",3]
[13022007,"Geelbuikastrilde m/p",null,"02",3]
[13022999,"Estrilda en coccopygia niet genoemde soorten wildkleur m/p",null,"02",3]
[13023900,"Mutanten estrilda en coccopygia soorten",null,"02",3]
[13023999,"Mutanten estrilda en coccopygia soorten (in standaard)",null,"02",3]
[13024001,"Afrikaanse citroencini",null,"02",3]
[13024002,"Barbata mozambiquesijs",null,"02",3]
[13024003,"Bos cini",null,"02",3]
[13024004,"Bruine cini",null,"02",3]
[13024005,"Burtoni dikbekcini",null,"02",3]
[13024006,"Citroenborst cini, citroenborst edelzanger",null,"02",3]
[13024007,"Diadeemcini, kivu sijs",null,"02",3]
[13024008,"Diksnavelcini",null,"02",3]
[13024009,"Geelbuikcini",null,"02",3]
[13024010,"Gestreepte cini",null,"02",3]
[13024011,"Granti mozambiquesijs",null,"02",3]
[13024012,"Maskercini",null,"02",3]
[13024013,"Mozambiquesijs",null,"02",3]
[13024014,"Reichenow edelzanger",null,"02",3]
[13024015,"Somereni zwartkeel geelstuit edelzanger",null,"02",3]
[13024016,"Streepkopcini",null,"02",3]
[13024017,"Witbuikcini",null,"02",3]
[13024018,"Witkeelcini",null,"02",3]
[13024019,"Witstuit edelzanger",null,"02",3]
[13024020,"Zuid-Afrikaanse cini",null,"02",3]
[13024021,"Zuidelijke citroencini",null,"02",3]
[13024022,"Zwartkeel geelstuitedelzanger",null,"02",3]
[13024023,"Zwavelgele dikbekcini",null,"02",3]
[13024999,"Crithagra en Cini soorten niet genoemd wildkleur m/p",null,"02",3]
[13025900,"Mutanten crithagra en cini soorten (in standaard)",null,"02",3]
[13025999,"Mutanten crithagra en cini soorten",null,"02",3]
[13026001,"Alariovink",null,"02",3]
[13026002,"Damara alariovink",null,"02",3]
[13026003,"Geelkruin cini",null,"02",3]
[13026004,"Kaapse kanarie, Grijsnek cini",null,"02",3]
[13026999,"Serinus soorten niet genoemd wildkleur m/p ",null,"02",3]
[13027900,"Mutanten serinus soorten ",null,"02",3]
[13027999,"Mutanten serinus soorten (in standaard)",null,"02",3]
[13028001,"Buffelwever",null,"02",3]
[13028002,"Witkopbuffelwever",null,"02",3]
[13028003,"Napoleonwever",null,"02",3]
[13028004,"Grenadierwever",null,"02",3]
[13028005,"Oranje wever",null,"02",3]
[13028006,"Tahawever",null,"02",3]
[13028007,"Zwartbuikwever",null,"02",3]
[13028008,"Kleine rotsmus",null,"02",3]
[13028009,"Kaapse rotsmus",null,"02",3]
[13028010,"Bruinruggoudmus",null,"02",3]
[13028011,"Emins mus",null,"02",3]
[13028012,"Geelbuikmus",null,"02",3]
[13028013,"Goudmus",null,"02",3]
[13028014,"Grijskopmus",null,"02",3]
[13028015,"Kaapse mus",null,"02",3]
[13028016,"Woestijnmus",null,"02",3]
[13028017,"Kaneelmus",null,"02",3]
[13028018,"Baja wever",null,"02",3]
[13028019,"Brilwever",null,"02",3]
[13028020,"Dwergmaskerwever",null,"02",3]
[13028021,"Geelrugwever",null,"02",3]
[13028022,"Goud wever",null,"02",3]
[13028023,"Grote textorwever",null,"02",3]
[13028024,"Kleine textorwever",null,"02",3]
[13028025,"Zwartvoorhoofd grenadierwever",null,"02",3]
[13028026,"Marmerwever",null,"02",3]
[13028027,"Kardinaalwever",null,"02",3]
[13028028,"Fluweelwever",null,"02",3]
[13028029,"Zwartmaskerroodbekwever",null,"02",3]
[13028030,"Afrikaanse baardman",null,"02",3]
[13028031,"Schubbenkopje",null,"02",3]
[13028032,"Staalvink",null,"02",3]
[13028999,"Overige wever en mussen soorten niet genoemd wildkleur m/p",null,"02",3]
[13029900,"Mutanten wever, staalvink, schubbenkopje en mus soorten",null,"02",3]
[13029999,"Mutanten wever, staalvink, schubbenkopje en mus soorten (in standaard)",null,"02",3]
[13030001,"Blauwgrijsbergpaapje",null,"02",3]
[13030002,"Grijze kroonvink",null,"02",3]
[13030003,"Rode kroonvink",null,"02",3]
[13030004,"Diucavink",null,"02",3]
[13030005,"Boliviaanse bergkardinaal",null,"02",3]
[13030006,"Mexicaanse nonpareil",null,"02",3]
[13030007,"Indigo vink",null,"02",3]
[13030008,"Lazuli vink",null,"02",3]
[13030009,"Regenboogvink",null,"02",3]
[13030010,"Veelkleurenvink",null,"02",3]
[13030011,"Purperkroonvink",null,"02",3]
[13030012,"Gewone saffraanvink",null,"02",3]
[13030013,"Kleine saffraanvink",null,"02",3]
[13030014,"Pelznersaffraanvink",null,"02",3]
[13030015,"Dicksissel",null,"02",3]
[13030016,"Witvoorhoofdpaapje",null,"02",3]
[13030017,"Moeraspaapje",null,"02",3]
[13030018,"Peru paapje",null,"02",3]
[13030019,"Zwartkopdikbekvink",null,"02",3]
[13030020,"Dikbekvink",null,"02",3]
[13030021,"Kleine cuba vink",null,"02",3]
[13030022,"Grote cubavink",null,"02",3]
[13030023,"Zwartborst cubavink",null,"02",3]
[13030024,"Bryanti grote cubavink",null,"02",3]
[13030025,"Jacarini vink",null,"02",3]
[13030026,"Bruinnekmusgors",null,"02",3]
[13030999,"Paapjes, cubavinken, kleurvinken niet genoemde soorten wildkleur m/p",null,"02",3]
[13031900,"Paapjes, cubavinken, kleurvinken niet genoemde mutanten m/p",null,"02",3]
[13031999,"Paapjes, cubavinken, kleurvinken niet genoemde mutanten m/p (in standaard)",null,"02",3]
[13032001,"Chinese groenling",null,"02",3]
[13032002,"Himalaya groenling",null,"02",3]
[13032003,"Vietnamese Groenling",null,"02",3]
[13032004,"Zwartkop groenling man",null,"02",3]
[13032005,"Zwartkop groenling pop",null,"02",3]
[13032006,"Elegant gors",null,"02",3]
[13032007,"Geelbuikgors",null,"02",3]
[13032008,"Grijskopgors",null,"02",3]
[13032009,"Japanse geelgors",null,"02",3]
[13032010,"Kaapse bruine gors",null,"02",3]
[13032011,"Kastanje gors",null,"02",3]
[13032012,"Kuifgors",null,"02",3]
[13032013,"Weide gors",null,"02",3]
[13032014,"Zevenstrepen gors",null,"02",3]
[13032015,"Gestreepte gors",null,"02",3]
[13032016,"Grote kaukasus roodmus",null,"02",3]
[13032017,"Nepal roodmus",null,"02",3]
[13032018,"Pallas roodmus",null,"02",3]
[13032019,"Wijnrode roodmus",null,"02",3]
[13032020,"Langstaartroodmus",null,"02",3]
[13032021,"Maskergoudvink",null,"02",3]
[13032022,"Nepalgoudvink",null,"02",3]
[13032023,"Blauwe goudvink",null,"02",3]
[13032024,"Roodkop goudvink",null,"02",3]
[13032025,"Roodwang goudvink",null,"02",3]
[13032026,"Oranje goudvink",null,"02",3]
[13032027,"Vale woestijnvink",null,"02",3]
[13032028,"Grijze junco",null,"02",3]
[13032999,"Uitheemse gors, mus, groenling en goudvinken soorten niet genoemd wildkleur m/p",null,"02",3]
[13033001,"Chinese groenling bruin",null,"02",3]
[13033002,"Chinese groenling agaat",null,"02",3]
[13033003,"Zwartkopgroenling bruin m/p",null,"02",3]
[13033004,"Zwartkopgroenling agaat man",null,"02",3]
[13033900,"Uitheemse groenlingen nieuwe mut. en comb. m/p",null,"02",3]
[13033999,"Uitheemse groenlingen nieuwe mut. en comb. m/p (in standaard)",null,"02",3]
[13034001,"Andessijs man",null,"02",3]
[13034002,"Andessijs pop",null,"02",3]
[13034003,"Baardsijs man",null,"02",3]
[13034004,"Baardsijs pop",null,"02",3]
[13034005,"Dennensijs man",null,"02",3]
[13034006,"Dennensijs pop",null,"02",3]
[13034007,"Geelbuiksijs man",null,"02",3]
[13034008,"Geelbuiksijs pop",null,"02",3]
[13034009,"Zwarte sijs man",null,"02",3]
[13034010,"Zwarte sijs pop",null,"02",3]
[13034011,"Haitisijs man",null,"02",3]
[13034012,"Haitisijs pop",null,"02",3]
[13034013,"Kordillensijs man",null,"02",3]
[13034014,"Kordillensijs pop",null,"02",3]
[13034015,"Lawrencesijs man",null,"02",3]
[13034016,"Lawrencesijs pop",null,"02",3]
[13034017,"Mexicosijs man",null,"02",3]
[13034018,"Mexicosijs pop",null,"02",3]
[13034019,"Columbia sijs man",null,"02",3]
[13034020,"Columbia sijs pop",null,"02",3]
[13034021,"Treursijs man",null,"02",3]
[13034022,"Treursijs pop",null,"02",3]
[13034023,"Yarrellsijs man",null,"02",3]
[13034024,"Yarrellsijs pop",null,"02",3]
[13034025,"Zwartborstsijs man",null,"02",3]
[13034026,"Zwartborstsijs pop",null,"02",3]
[13034999,"Amerikaanse sijs soorten wildkleur m/p niet genoemd ",null,"02",3]
[13035900,"Amerikaanse sijzen niet genoemde mutanten",null,"02",3]
[13035999,"Amerikaanse sijzen nieuwe mut. en comb. (in standaard)",null,"02",3]
[13036001,"Blauwzwarte bisschop",null,"07",3]
[13036002,"Brazilliaanse blauwe bisschop",null,"07",3]
[13036003,"Indigo bisschop",null,"07",3]
[13036004,"Mexicaanse blauwe bisschop",null,"07",3]
[13036005,"Noord amerikaanse blauwe bisschop",null,"07",3]
[13036006,"Donkerblauwe bisschop",null,"07",3]
[13036999,"Bischop soorten wildkleur m/p niet genoemd",null,"07",3]
[13037900,"Mutanten bischop soorten",null,"07",3]
[13037999,"Mutanten bischop soorten (in standaard)",null,"07",3]
[13038001,"Rode kardinaal",null,"07",3]
[13038002,"Groene kardinaal",null,"07",3]
[13038003,"Vermiljoenkardinaal",null,"07",3]
[13038004,"Dominikanerkardinaal",null,"07",3]
[13038005,"Karmozijnkeelkardinaal",null,"07",3]
[13038006,"Mantelkardinaal",null,"07",3]
[13038007,"Roodkuifkardinaal",null,"07",3]
[13038008,"Zwartkeelkardinaal",null,"07",3]
[13038009,"Zwartwangkardinaal",null,"07",3]
[13038010,"Arizona kardinaal",null,"07",3]
[13038999,"Kardinaal soorten wildkleur m/p niet genoemd",null,"07",3]
[13039900,"Mutanten kardinaal soorten",null,"07",3]
[13039999,"Mutanten kardinaal soorten",null,"07",3]
[13040001,"Zwartmaskerkernbijter",null,"07",3]
[13040002,"Avondkernbijter",null,"07",3]
[13040003,"Geelbuikkernbijter",null,"07",3]
[13040004,"Gele kernbijter",null,"07",3]
[13040005,"Rozenborstkernbijter",null,"07",3]
[13040006,"Zwartkopkernbijter",null,"07",3]
[13040007,"Grijszwarte kernbijter",null,"07",3]
[13040008,"Leigrijze kernbijter",null,"07",3]
[13040999,"Kernbijter soorten wildkleur m/p iet genoemd",null,"07",3]
[13041900,"Mutante kernbijter soorten",null,"07",3]
[13041999,"Mutante kernbijter (in standaard)",null,"07",3]
[13042001,"Chinese appelvink",null,"07",3]
[13042002,"Gele appelvink",null,"07",3]
[13042003,"Himalaya appelvink",null,"07",3]
[13042004,"Japanse appelvink",null,"07",3]
[13042005,"Mexicaanse appelvink",null,"07",3]
[13042006,"Witvleugel appelvink",null,"07",3]
[13042007,"Zwartgele appelvink",null,"07",3]
[13042008,"Himalaya haakbek",null,"07",3]
[13042009,"Himalaya kruisbek",null,"07",3]
[13042999,"Appelvink, haak- en kruisbek soorten wildkleur m/p niet genoemd",null,"07",3]
[13043900,"Mutanten appelvinken en haakbekken",null,"07",3]
[13043999,"Mutanten appelvinken en haakbekken (in standaard)",null,"07",3]
[13044001,"Fischers wida",null,"07",3]
[13044002,"Koningswida",null,"07",3]
[13044003,"Dominikanerwida",null,"07",3]
[13044004,"Paradijswida",null,"07",3]
[13044005,"Roodschouder wida",null,"07",3]
[13044006,"Spiegelwida",null,"07",3]
[13044007,"Roodkeelwida",null,"07",3]
[13044999,"Wida soorten wildkleur m/p niet genoemd ",null,"07",3]
[13045900,"Mutanten widasoorten",null,"07",3]
[13045999,"Mutanten widasoorten (in standaard)",null,"07",3]
[14001001,"Bichenowastrilde x Binsenastrilde (ook andersom)",null,"02",2]
[14001002,"Bichenowastrilde x Ceresamadine (ook andersom)",null,"02",2]
[14001003,"Bichenowastrilde x Diamantvink (ook andersom)",null,"02",2]
[14001004,"Bichenowastrilde x Japanse meeuw (ook andersom)",null,"02",2]
[14001005,"Binsenastrild x Diamantvink (ook andersom)",null,"02",2]
[14001006,"Binsenastrilde x Ceresamadine (ook andersom)",null,"02",2]
[14001007,"Binsenastrilde x Japanse meeuw (ook andersom)",null,"02",2]
[14001008,"Binsenastrilde x Spitstaartamadine (ook andersom)",null,"02",2]
[14001009,"Bruinborstrietvink x Ceresamadine (ook andersom)",null,"02",2]
[14001010,"Bruinborstrietvink x Diamantvink (ook andersom)",null,"02",2]
[14001011,"Bruinborstrietvink x Spitsstaartamadine (ook andersom)",null,"02",2]
[14001012,"Bruinborstrietvink x Rijstvogel (ook andersom)",null,"02",2]
[14001013,"Ceresamadine x Diamantvink (ook andersom)",null,"02",2]
[14001014,"Ceresamadine x Japanse meeuw (ook andersom)",null,"02",2]
[14001015,"Gordelgrasvink x Japanse meeuw (ook andersom)",null,"02",2]
[14001016,"Japanse meeuw x Diamantvink (ook andersom)",null,"02",2]
[14001017,"Japanse meeuw x Rijstvogel (ook andersom)",null,"02",2]
[14001018,"Loodbekje x Bichenowastrilde (ook andersom)",null,"02",2]
[14001019,"Loodbekje x Ceresamadine (ook andersom)",null,"02",2]
[14001020,"Maskeramadine x Ceresamadine (ook andersom)",null,"02",2]
[14001021,"Spitsstaartamadine x Ceresamadine (ook andersom)",null,"02",2]
[14001022,"Spitsstaartamadine x Japanse meeuw (ook andersom)",null,"02",2]
[14001023,"Zebravink x Bichenow astrilde  (ook andersom)",null,"02",2]
[14001024,"Zebravink x Binsenastrilde (ook andersom)",null,"02",2]
[14001025,"Zebravink x Ceresamadine (ook andersom)",null,"02",2]
[14001026,"Zebravink x Diamantvink (ook andersom)",null,"02",2]
[14001027,"Zebravink x Japanse meeuw (ook andersom)",null,"02",2]
[14001028,"Zilverbekje x Bichenowastrilde (ook andersom)",null,"02",2]
[14001029,"Zilverbekje x Binsenastrilde (ook andersom)",null,"02",2]
[14001030,"Zilverbekje x Ceresamadine (ook andersom)",null,"02",2]
[14001031,"Zilverbekje x Diamantvink (ook andersom)",null,"02",2]
[14001032,"Zilverbekje x Rijstvogel (ook andersom)",null,"02",2]
[14001033,"Zilverbekje x Spitsstaartamadine (ook andersom)",null,"02",2]
[14001999,"Niet genoemde comb. Exoot x Exoot",null,"02",2]
[14002001,"Kanarie x Zwavelgele dikbekcini (ook andersom)",null,"02",2]
[14002002,"Kanarie x Kapoetsensijs (ook andersom)",null,"02",2]
[14002003,"Kanarie x Baardsijs (ook andersom)",null,"02",2]
[14002004,"Kanarie x Dennensijs (ook andersom)",null,"02",2]
[14002005,"Kanarie x Magellaansijs (ook andersom)",null,"02",2]
[14002006,"Kanarie x Zwartborstsijs (ook andersom)",null,"02",2]
[14002007,"Kanarie x Zwarte sijs (ook andersom)",null,"02",2]
[14002008,"Kanarie x Mexicaanse roodmus (ook andersom)",null,"02",2]
[14002999,"Kanarie x exoot (ook andersom) niet genoemde comb.",null,"02",2]
[14003001,"Barmsijs x Chinese groenling (ook andersom)",null,"02",2]
[14003002,"Barmsijs x Zwartkopgroenling (ook andersom)",null,"02",2]
[14003003,"Barmsijs x Mexicaanse roodmus (ook andersom)",null,"02",2]
[14003004,"Barmsijs x Zwavelgele dikbekcini (ook andersom)",null,"02",2]
[14003005,"Frater x Mexicaanse roodmus (ook andersom)",null,"02",2]
[14003006,"Groenling x Magellaansijs (ook andersom)",null,"02",2]
[14003007,"Groenling x Zwarte sijs (ook andersom)",null,"02",2]
[14003008,"Groenling x Zwavelgele dikbekcini (ook andersom)",null,"02",2]
[14003009,"Himalaya kruisbek x Goudvink",null,"02",2]
[14003010,"Kruisbek x Mexicaanse roodmus (ook andersom)",null,"02",2]
[14003011,"Mexicaanse roodmus x Goudvink ",null,"02",2]
[14003012,"Putter x Baardsijs (ook andersom)",null,"02",2]
[14003013,"Putter x Chinese groenling (ook andersom)",null,"02",2]
[14003014,"Putter x Kapoetsensijs (ook andersom)",null,"02",2]
[14003015,"Putter x Magellaansijs (ook andersom)",null,"02",2]
[14003016,"Putter x Mexicaanse roodmus (ook andersom)",null,"02",2]
[14003017,"Putter x Zwartkopgroenling (ook andersom)",null,"02",2]
[14003018,"Putter x Zwavelgele dikbekcini (ook andersom)",null,"02",2]
[14003019,"Sijs x Chinese groenling (ook andersom)",null,"02",2]
[14003020,"Sijs x Zwartkopgroenling (ook andersom)",null,"02",2]
[14003999,"Europees x Exoot (ook andersom) niet genoemde comb. ",null,"02",2]
[14004001,"Barmsijs x kanarie (ook andersom)",null,"02",2]
[14004002,"Frater x Kanarie (ook andersom)",null,"02",2]
[14004003,"Groenling x Kanarie (ook andersom)",null,"02",2]
[14004004,"Kanarie x Goudvink",null,"02",2]
[14004005,"Kneu x kanarie (ook andersom)",null,"02",2]
[14004006,"Putter x Kanarie (ook andersom)",null,"02",2]
[14004007,"Sijs x Kanarie (ook andersom)",null,"02",2]
[14004008,"Kanarie x Trompet woestijnvink (ook andersom)",null,"02",2]
[14004999,"Europees x Kanarie (ook andersom) niet genoemde comb. ",null,"02",2]
[14005001,"Barmsijs x Europese sijs (ook andersom)",null,"02",2]
[14005002,"Barmsijs x Groenling (ook andersom)",null,"02",2]
[14005003,"Barmsijs x Kneu (ook andersom)",null,"02",2]
[14005004,"Barmsijs x Putter (ook andersom)",null,"02",2]
[14005005,"Barmsijs x Goudvink",null,"02",2]
[14005007,"Kneu x Goudvink",null,"02",2]
[14005008,"Kruisbek x Goudvink",null,"02",2]
[14005009,"Kruisbek x Groenling (ook andersom)",null,"02",2]
[14005010,"Kruisbek x Kneu (ook andersom)",null,"02",2]
[14005011,"Kruisbek x Putter (ook andersom)",null,"02",2]
[14005012,"Witband kruisbek x Goudvink",null,"02",2]
[14005013,"Witband kruisbek x Putter (ook andersom)",null,"02",2]
[14005014,"Putter x Groenling (ook andersom)",null,"02",2]
[14005015,"Putter x Kneu (ook andersom)",null,"02",2]
[14005016,"Putter x Sijs (ook andersom)",null,"02",2]
[14005017,"Putter x Goudvink",null,"02",2]
[14005018,"Sijs x Kneu (ook andersom)",null,"02",2]
[14005999,"Europees x Europees niet genoemde comb. ",null,"02",2]
[15001001,"Europese cini wildkleur man",null,"02",3]
[15001002,"Europese cini wildkleur pop",null,"02",3]
[15001003,"Citroensijs wildkleur man",null,"02",3]
[15001004,"Citroensijs wildkleur pop",null,"02",3]
[15001005,"Roodvoorhoofdkanarie wildkleur",null,"02",3]
[15001006,"Wilde kanarie (serinus canaria) wildkleur",null,"02",3]
[15002001,"Kleine putter  m/p",null,"02",3]
[15002002,"Grote putter  m/p",null,"02",3]
[15002003,"Grijskop putter m/p",null,"02",3]
[15004001,"Groenling man",null,"02",3]
[15004002,"Groenling pop",null,"02",3]
[15005001,"Kleine barmsijs m/p",null,"02",3]
[15006001,"Grote barmsijs m/p",null,"02",3]
[15007001,"Witstuit barmsijs m/p",null,"02",3]
[15008001,"Sijs man",null,"02",3]
[15008002,"Sijs pop",null,"02",3]
[15009001,"Kneu m/p",null,"02",3]
[15009002,"Frater m/p",null,"02",3]
[15010001,"Geelgors man",null,"02",3]
[15010002,"Geelgors pop",null,"02",3]
[15010003,"Cirlgors m/p",null,"02",3]
[15010004,"Zwartkopgors m/p",null,"02",3]
[15010005,"Grauwegors m/p",null,"02",3]
[15010006,"Marokaanse huisgors m/p",null,"02",3]
[15010007,"Grijzegors m/p",null,"02",3]
[15010008,"Rietgors man",null,"02",3]
[15010009,"Rietgors pop",null,"02",3]
[15010010,"Ortolaan man",null,"02",3]
[15010011,"Ortolaan pop",null,"02",3]
[15010999,"Gorzen niet genoemde soorten",null,"02",3]
[15011001,"Huismus man",null,"02",3]
[15011002,"Huismus pop",null,"02",3]
[15011003,"Ringmus m/p",null,"02",3]
[15011004,"Spaanse mus m/p",null,"02",3]
[15011005,"Italiaanse mus m/p",null,"02",3]
[15011006,"Rotsmus m/p",null,"02",3]
[15011999,"Mussen niet genoemde soorten m/p",null,"02",3]
[15012001,"Europese roodmus m/p",null,"02",3]
[15012002,"Trompet woestijnvink m/p",null,"02",3]
[15012999,"Niet genoemde Europese roodmus en woestijnvink wildkleur",null,"02",3]
[15013001,"Vink man",null,"02",3]
[15013002,"Vink pop",null,"02",3]
[15013003,"Keep man",null,"02",3]
[15013004,"Keep pop",null,"02",3]
[15014001,"Kleine goudvink man",null,"02",3]
[15014002,"Kleine goudvink pop",null,"02",3]
[15015001,"Grote goudvink man",null,"02",3]
[15015002,"Grote goudvink pop",null,"02",3]
[15016001,"Kruisbek man",null,"07",3]
[15016002,"Kruisbek pop",null,"07",3]
[15016003,"Grote Kruisbek man",null,"07",3]
[15016004,"Grote kruisbek pop",null,"07",3]
[15016005,"Schotse Kruisbek man",null,"07",3]
[15016006,"Schotse Kruisbek pop",null,"07",3]
[15016007,"Witband Kruisbek man",null,"07",3]
[15016008,"Witband Kruisbek pop",null,"07",3]
[15017001,"Appelvink m/p",null,"07",3]
[15017002,"Haakbek man",null,"07",3]
[15017003,"Haakbek pop",null,"07",3]
[15018001,"Koolmees m/p",null,"07",5]
[15018002,"Pimpelmees m/p",null,"07",5]
[15018003,"Staartmees m/p",null,"07",5]
[15018004,"Matkopmees m/p",null,"07",5]
[15018005,"Kuifmees m/p",null,"07",5]
[15018006,"Azuurmees m/p",null,"07",5]
[15018007,"Zwartemees m/p",null,"07",5]
[15018008,"Baardmannetje man",null,"07",5]
[15018009,"Baardmannetje pop",null,"07",5]
[15018010,"Winterkoninkje m/p",null,"07",5]
[15018011,"Roodborstje m/p",null,"07",5]
[15018013,"Zwartkop man",null,"07",5]
[15018014,"Zwartkop pop",null,"07",5]
[15018015,"Blauwstaartje m/p",null,"07",5]
[15018016,"Gekraagde roodstaart m/p",null,"07",5]
[15018017,"Zwarte roodstaart m/p",null,"07",5]
[15018018,"Witte kwikstaart m/p",null,"07",5]
[15018019,"Grote gele kwikstaart m/p",null,"07",5]
[15018020,"Gele kwikstaart m/p",null,"07",5]
[15018021,"Wit gesternde blauwborst m/p",null,"07",5]
[15018022,"Rood gesternde blauwborst m/p",null,"07",5]
[15018023,"Boomklever m/p",null,"07",5]
[15018024,"Boomkruiper m/p",null,"07",5]
[15018025,"Goudhaantje m/p",null,"07",5]
[15018026,"Vuurgoudhaantje m/p",null,"07",5]
[15018999,"Europese cultuur VI groep 1 niet genoemde soorten ",null,"07",5]
[15019001,"Rietzanger m/p",null,"07",5]
[15019002,"Braamsluiper m/p",null,"07",5]
[15019003,"Grasmus m/p",null,"07",5]
[15019004,"Sperwer grasmus m/p",null,"07",5]
[15019005,"Tuinfluiter m/p",null,"07",5]
[15019006,"Fitis m/p",null,"07",5]
[15019007,"Heggenmus m/p",null,"07",5]
[15019008,"Veldleeuwerik m/p",null,"07",5]
[15019009,"Kuifleeuwerik m/p",null,"07",5]
[15019010,"Boomleeuwerik m/p",null,"07",5]
[15019011,"Graspieper m/p",null,"07",5]
[15019012,"Boompieper m/p",null,"07",5]
[15019013,"Tapuit m/p",null,"07",5]
[15019014,"Roodborst tapuit m/p",null,"07",5]
[15019015,"Isabel tapuit",null,"07",5]
[15019016,"Zwarte tapuit m/p",null,"07",5]
[15019017,"Blonde tapuit m/p",null,"07",5]
[15019018,"Europese nachtegaal m/p",null,"07",5]
[15019019,"Roodkeel nachtegaal m/p",null,"07",5]
[15019020,"Tjiftjaf m/p",null,"07",5]
[15019021,"Bonte vliegenvanger m/p",null,"07",5]
[15019022,"Grauwe vliegenvanger m/p",null,"07",5]
[15019999,"Europese cultuur VI groep 2 niet genoemde soorten",null,"07",5]
[15020001,"Spreeuw m/p",null,"07",5]
[15020002,"Zwarte spreeuw m/p",null,"07",5]
[15020003,"Rose spreeuw m/p",null,"07",5]
[15020004,"Pestvogel m/p",null,"07",5]
[15020999,"Europese cultuur VI Groep 3 niet genoemde soorten ",null,"07",5]
[15021001,"Merel man",null,"07",5]
[15021002,"Merel pop",null,"07",5]
[15021003,"Zanglijster m/p",null,"07",5]
[15021004,"Grote lijster m/p",null,"07",5]
[15021005,"Koperwiek m/p",null,"07",5]
[15021006,"Kramsvogel m/p",null,"07",5]
[15021007,"Beflijster man",null,"07",5]
[15021008,"Beflijster pop",null,"07",5]
[15021999,"Europese cultuur VI  groep 4 niet genoemde soorten  ",null,"07",5]
[15022001,"Grauwe klauwier m/p",null,"07",5]
[15022002,"Roodkop klauwier m/p",null,"07",5]
[15022003,"Klapekster m/p",null,"07",5]
[15022004,"Draaihals m/p",null,"07",5]
[15022005,"Bijeneter m/p",null,10,5]
[15022006,"Hop m/p",null,10,5]
[15022007,"Europese scharrelaar m/p",null,10,5]
[15022999,"Europese cultuur VI groep 5 niet genoemde soorten",null,10,5]
[15023001,"Kauw m/p",null,10,5]
[15023002,"Zwarte Kraai m/p",null,10,5]
[15023003,"Bonte kraai m/p",null,10,5]
[15023004,"Ekster m/p",null,10,5]
[15023005,"Europese blauwe ekster m/p",null,10,5]
[15023006,"Gaai m/p",null,10,5]
[15023007,"Notenkraker m/p",null,10,5]
[15023999,"Europese cultuur VI groep 6 niet genoemde soorten",null,10,5]
[15024001,"Zomer tortel m/p",null,"09",3]
[15024002,"Turkse tortel m/p",null,"09",3]
[15024003,"Holenduif m/p",null,"09",3]
[15024004,"Houtduif m/p",null,"09",3]
[15024005,"Rotsduif m/p",null,"09",3]
[15024999,"Europese duiven niet genoemd (alleen wildkleur) m/p",null,"09",3]
[15025001,"Europese kwartel (alleen wildkleur) haan / hen",null,"09",3]
[15025002,"Europese patrijs haan / hen",null,"09",3]
[15025003,"Europese steenpatrijs haan / hen",null,"09",3]
[15025004,"Chukarpatrijs haan / hen",null,"09",3]
[15025005,"Barbarijse patrijs haan / hen",null,"09",3]
[15025006,"Rode steenpatrijs haan / hen",null,"09",3]
[15025999,"Europese patrijzen niet genoemd (alleen wildkleur) haan / hen",null,"09",3]
[16001001,"Grote putter bruin m/p",null,"02",3]
[16001002,"Grote putter agaat m/p",null,"02",3]
[16001003,"Grote putter pastel m/p",null,"02",3]
[16001004,"Grote putter bruin-agaat m/p",null,"02",3]
[16001005,"Grote putter bruinpastel m/p",null,"02",3]
[16001006,"Grote putter agaatpastel  m/p",null,"02",3]
[16001007,"Grote putter aminet m/p",null,"02",3]
[16001008,"Grote putter satinet m/p",null,"02",3]
[16001009,"Grote putter dominant geel m/p",null,"02",3]
[16001010,"Grote putter opaal m/p",null,"02",3]
[16001011,"Grote putter bruinopaal m/p",null,"02",3]
[16001012,"Grote putter agaatopaal m/p",null,"02",3]
[16001013,"Grote putter witkop m/p",null,"02",3]
[16001014,"Grote putter bruin witkop m/p",null,"02",3]
[16001015,"Grote putter agaat witkop m/p",null,"02",3]
[16001016,"Grote putter pastel witkop m/p",null,"02",3]
[16001017,"Grote putter bruin-agaat witkop m/p",null,"02",3]
[16001018,"Grote putter satinet witkop m/p",null,"02",3]
[16001100,"Grote putter bont in alle enkelvoudige mut. kleuren m/p",null,"02",3]
[16001900,"Grote putter nieuwe nog niet erkende mut. en comb. m/p",null,"02",3]
[16001999,"Grote putter nieuwe mut. en comb. m/p (in standaard)",null,"02",3]
[16002001,"Groenling bruin man",null,"02",3]
[16002002,"Groenling bruin pop",null,"02",3]
[16002003,"Groenling agaat man",null,"02",3]
[16002004,"Groenling agaat pop",null,"02",3]
[16002005,"Groenling bruin-agaat man",null,"02",3]
[16002006,"Groenling bruin-agaat pop",null,"02",3]
[16002007,"Groenling pastel man",null,"02",3]
[16002008,"Groenling pastel pop",null,"02",3]
[16002009,"Groenling bruinpastel man",null,"02",3]
[16002010,"Groenling bruinpastel pop",null,"02",3]
[16002011,"Groenling agaatpastel man",null,"02",3]
[16002012,"Groenling agaatpastel pop",null,"02",3]
[16002013,"Groenling satinet man",null,"02",3]
[16002014,"Groenling satinet pop",null,"02",3]
[16002030,"Groenling dominant geel man",null,"02",3]
[16002031,"Groenling dominant geel pop",null,"02",3]
[16002032,"Groenling dominant geel bruin man",null,"02",3]
[16002033,"Groenling dominant geel bruin pop",null,"02",3]
[16002034,"Groenling dominant geel agaat man",null,"02",3]
[16002035,"Groenling dominant geel agaat pop",null,"02",3]
[16002036,"Groenling dominant geel bruin-agaat man",null,"02",3]
[16002037,"Groenling dominant geel bruin-agaat pop",null,"02",3]
[16002050,"Groenling dominant EF pastel man",null,"02",3]
[16002051,"Groenling dominant EF pastel pop",null,"02",3]
[16002052,"Groenling dominant EF pastel bruin man",null,"02",3]
[16002053,"Groenling dominant EF pastel bruin pop",null,"02",3]
[16002054,"Groenling dominant EF pastel agaat man",null,"02",3]
[16002055,"Groenling dominant EF pastel agaat pop",null,"02",3]
[16002056,"Groenling dominant EF pastel bruin-agaat man",null,"02",3]
[16002057,"Groenling dominant EF pastel bruin-agaat pop",null,"02",3]
[16002058,"Groenling dominant DF pastel  man",null,"02",3]
[16002059,"Groenling dominant DF pastel bruin man",null,"02",3]
[16002060,"Groenling dominant DF pastel agaat man",null,"02",3]
[16002061,"Groenling dominant DF pastel bruin-agaat man",null,"02",3]
[16002100,"Groenling bont enkelvoudige mut. man",null,"02",3]
[16002101,"Groenling bont enkelvoudige mut. pop",null,"02",3]
[16002900,"Europese groenling nieuwe nog niet erkende mut. en comb. m/p",null,"02",3]
[16002999,"Europese groenling nieuwe mut. en comb. m/p (in standaard)",null,"02",3]
[16003001,"Kleine barmsijs bruin m/p",null,"02",3]
[16003002,"Kleine barmsijs agaat m/p",null,"02",3]
[16003003,"Kleine barmsijs bruin-agaat m/p",null,"02",3]
[16003004,"Kleine barmsijs pastel m/p",null,"02",3]
[16003005,"Kleine barmsijs bruinpastel m/p",null,"02",3]
[16003006,"Kleine barmsijs agaatpastel m/p",null,"02",3]
[16003007,"Kleine barmsijs phaeo m/p",null,"02",3]
[16003008,"Kleine barmsijs donker factor m/p",null,"02",3]
[16003009,"Kleine barmsijs donker factor bruin m/p",null,"02",3]
[16003010,"Kleine barmsijs donker factor agaat m/p",null,"02",3]
[16003011,"Kleine barmsijs donker factor pastel m/p",null,"02",3]
[16003012,"Kleine barmsijs donker factor bruinpastel m/p",null,"02",3]
[16003100,"Kleine barmsijs bont enkelvoudige mut. m/p",null,"02",3]
[16003900,"Kleine barmsijs nieuwe nog niet erkende mut. en comb. m/p",null,"02",3]
[16003999,"Kleine barmsijs nieuwe mut. en comb. m/p (in standaard)",null,"02",3]
[16004001,"Grote barmsijs bruin m/p",null,"02",3]
[16004002,"Grote barmsijs agaat m/p",null,"02",3]
[16004003,"Grote barmsijs pastel m/p",null,"02",3]
[16004004,"Grote barmsijs bruin-agaat m/p",null,"02",3]
[16004008,"Grote barmsijs donker factor m/p",null,"02",3]
[16004100,"Grote barmsijs bont enkelvoudige mut. m/p",null,"02",3]
[16004900,"Grote barmsijs nieuwe nog niet erkende mut. en comb. m/p",null,"02",3]
[16004999,"Grote barmsijs nieuwe mut. en comb. m/p (in standaard)",null,"02",3]
[16005001,"Sijs bruin man",null,"02",3]
[16005002,"Sijs bruin pop",null,"02",3]
[16005003,"Sijs agaat man",null,"02",3]
[16005004,"Sijs agaat pop",null,"02",3]
[16005005,"Sijs bruin-agaat man",null,"02",3]
[16005006,"Sijs bruin-agaat pop",null,"02",3]
[16005010,"Sijs EF pastel man",null,"02",3]
[16005011,"Sijs EF pastel pop",null,"02",3]
[16005012,"Sijs EF pastel bruin man",null,"02",3]
[16005013,"Sijs EF pastel bruin pop",null,"02",3]
[16005014,"Sijs EF pastel agaat man",null,"02",3]
[16005015,"Sijs EF pastel agaat pop",null,"02",3]
[16005016,"Sijs EF pastel bruin-agaat man",null,"02",3]
[16005017,"Sijs EF pastel bruin-agaat pop",null,"02",3]
[16005018,"Sijs EF pastel ivoor man",null,"02",3]
[16005019,"Sijs EF pastel ivoor pop",null,"02",3]
[16005020,"Sijs DF pastel man",null,"02",3]
[16005021,"Sijs DF pastel pop",null,"02",3]
[16005030,"Sijs ivoor man",null,"02",3]
[16005031,"Sijs ivoor pop",null,"02",3]
[16005032,"Sijs bruin ivoor man",null,"02",3]
[16005033,"Sijs bruin ivoor pop",null,"02",3]
[16005034,"Sijs agaat ivoor man",null,"02",3]
[16005035,"Sijs agaat ivoor pop",null,"02",3]
[16005036,"Sijs bruin-agaat ivoor man",null,"02",3]
[16005037,"Sijs bruin-agaat ivoor pop",null,"02",3]
[16005040,"Sijs topaas man",null,"02",3]
[16005041,"Sijs topaas pop",null,"02",3]
[16005042,"Sijs bruintopaas man",null,"02",3]
[16005043,"Sijs bruintopaas pop",null,"02",3]
[16005044,"Sijs agaattopaas man",null,"02",3]
[16005045,"Sijs agaattopaas pop",null,"02",3]
[16005046,"Sijs bruin-agaat topaas man",null,"02",3]
[16005047,"Sijs bruin-agaat topaas pop",null,"02",3]
[16005048,"Sijs ivoor topaas man",null,"02",3]
[16005049,"Sijs ivoor topaas pop",null,"02",3]
[16005050,"Sijs bruin ivoor topaas man",null,"02",3]
[16005051,"Sijs bruin ivoor topaas pop",null,"02",3]
[16005052,"Sijs agaat ivoor topaas man",null,"02",3]
[16005053,"Sijs agaat ivoor topaas pop",null,"02",3]
[16005060,"Sijs Dominant geel man",null,"02",3]
[16005061,"Sijs Dominant geel pop",null,"02",3]
[16005062,"Sijs Dominant geel bruin man",null,"02",3]
[16005063,"Sijs Dominant geel bruin pop",null,"02",3]
[16005064,"Sijs Dominant geel agaat man",null,"02",3]
[16005065,"Sijs Dominant geel agaat pop",null,"02",3]
[16005066,"Sijs Dominant geel bruin-agaat man",null,"02",3]
[16005067,"Sijs Dominant geel bruin-agaat pop",null,"02",3]
[16005900,"Sijs nieuwe nog niet erkende mut. en comb. m/p ",null,"02",3]
[16005999,"Sijs nieuwe mut. en comb. m/p (in standaard)",null,"02",3]
[16006001,"Kneu pastel m/p",null,"02",3]
[16006900,"Kneu en Frater nieuwe nog niet erkende mut. en comb. m/p ",null,"02",3]
[16006999,"Kneu en Frater nieuwe mut. en comb. m/p (in standaard)",null,"02",3]
[16007001,"Huismus bruin man",null,"02",3]
[16007002,"Huismus bruin pop",null,"02",3]
[16007003,"Huismus agaat man",null,"02",3]
[16007004,"Huismus agaat pop",null,"02",3]
[16007005,"Huismus bruin-agaat man",null,"02",3]
[16007006,"Huismus bruin-agaat pop",null,"02",3]
[16007007,"Huismus SL ino man",null,"02",3]
[16007008,"Huismus SL ino pop",null,"02",3]
[16007009,"Huismus pastel man",null,"02",3]
[16007010,"Huismus pastel pop",null,"02",3]
[16007011,"Huismus bruinpastel man",null,"02",3]
[16007012,"Huismus bruinpastel pop",null,"02",3]
[16007013,"Huismus agaatpastel man",null,"02",3]
[16007014,"Huismus agaatpastel pop",null,"02",3]
[16007015,"Huismus satinet man",null,"02",3]
[16007016,"Huismus satinet pop",null,"02",3]
[16007017,"Huismus opaal man",null,"02",3]
[16007018,"Huismus opaal pop",null,"02",3]
[16007019,"Huismus bruinopaal man",null,"02",3]
[16007020,"Huismus bruinopaal pop",null,"02",3]
[16007021,"Huismus agaat opaal man",null,"02",3]
[16007022,"Huismus agaat opaal pop",null,"02",3]
[16007023,"Huismus phaeo man",null,"02",3]
[16007024,"Huismus phaeo pop",null,"02",3]
[16007025,"Huismus bruin phaeo man",null,"02",3]
[16007026,"Huismus bruin phaeo pop",null,"02",3]
[16007027,"Huismus zwartborst pop",null,"02",3]
[16007028,"Huismus zwartborst man",null,"02",3]
[16007029,"Ringmus bruin",null,"02",3]
[16007030,"Ringmus roodbruin",null,"02",3]
[16007031,"Ringmus pastel",null,"02",3]
[16007032,"Ringmus opaal",null,"02",3]
[16007900,"Huis- en ringmus nieuwe nog niet erkende mut. en comb. m/p ",null,"02",3]
[16007999,"Huis- en ringmus nieuwe mut. en comb. m/p (in standaard)",null,"02",3]
[16008001,"Vink bruin man",null,"02",3]
[16008002,"Vink bruin pop",null,"02",3]
[16008003,"Vink agaat man",null,"02",3]
[16008004,"Vink agaat pop",null,"02",3]
[16008007,"Vink bruin-agaat man",null,"02",3]
[16008008,"Vink bruin-agaat pop",null,"02",3]
[16008009,"Vink pastel man",null,"02",3]
[16008010,"Vink pastel pop",null,"02",3]
[16008011,"Vink pastelbruin man",null,"02",3]
[16008012,"Vink pastelbruin pop",null,"02",3]
[16008013,"Vink pastelagaat man",null,"02",3]
[16008014,"Vink pastelagaat pop",null,"02",3]
[16008015,"Vink pastel bruin-agaat man",null,"02",3]
[16008016,"Vink pastel bruin-agaat pop",null,"02",3]
[16008017,"Vink opaal man",null,"02",3]
[16008018,"Vink opaal pop",null,"02",3]
[16008019,"Vink bruinopaal man",null,"02",3]
[16008020,"Vink bruinopaal pop",null,"02",3]
[16008021,"Vink agaatopaal man",null,"02",3]
[16008022,"Vink agaatopaal pop",null,"02",3]
[16008023,"Vink Dominant EF pastel man",null,"02",3]
[16008024,"Vink Dominant EF pastel pop",null,"02",3]
[16008025,"Vink Dominant EF pastel bruin man",null,"02",3]
[16008026,"Vink Dominant EF pastel bruin pop",null,"02",3]
[16008027,"Vink Dominant EF pastel agaat man",null,"02",3]
[16008028,"Vink Dominant EF pastel agaat pop",null,"02",3]
[16008900,"Vink nieuwe nog niet erkende mut. en comb. m/p",null,"02",3]
[16008999,"Vink nieuwe mut. en comb. m/p (in standaard)",null,"02",3]
[16009001,"Grote goudvink bruin man",null,"02",3]
[16009002,"Grote goudvink bruin pop",null,"02",3]
[16009005,"Grote goudvink pastel man",null,"02",3]
[16009006,"Grote goudvink pastel pop",null,"02",3]
[16009007,"Grote goudvink bruinpastel man",null,"02",3]
[16009008,"Grote goudvink bruinpastel pop",null,"02",3]
[16009009,"Grote goudvink topaas man",null,"02",3]
[16009010,"Grote goudvink topaas pop",null,"02",3]
[16009011,"Grote goudvink bruintopaas man",null,"02",3]
[16009012,"Grote goudvink bruintopaas pop",null,"02",3]
[16009013,"Grote goudvink geel man",null,"02",3]
[16009014,"Grote goudvink geel pop",null,"02",3]
[16009015,"Grote goudvink bruingeel man",null,"02",3]
[16009016,"Grote goudvink bruingeel pop",null,"02",3]
[16009017,"Grote goudvink pastel geel man",null,"02",3]
[16009018,"Grote goudvink pastel geel pop",null,"02",3]
[16009019,"Grote goudvink bruinpastel geel man",null,"02",3]
[16009020,"Grote goudvink bruinpastel geel pop",null,"02",3]
[16009021,"Grote goudvink wit man",null,"02",3]
[16009022,"Grote goudvink wit pop",null,"02",3]
[16009023,"Grote goudvink wit geel man",null,"02",3]
[16009024,"Grote goudvink wit geel pop",null,"02",3]
[16009100,"Grote goudvink bont enkelvoudige mut. m/p",null,"02",3]
[16009900,"Grote goudvink nieuwe nog niet erkende mut. en mut.m/p",null,"02",3]
[16009999,"Grote goudvink nieuwe mut. en comb. m/p (in standaard)",null,"02",3]
[16010001,"Spreeuw bruin m/p",null,"07",5]
[16010002,"Spreeuw pastel m/p",null,"07",5]
[16010003,"Spreeuw bruin pastel m/p",null,"07",5]
[16010004,"Spreeuw satinet m/p",null,"07",5]
[16010005,"Spreeuw phaeo m/p",null,"07",5]
[16010006,"Spreeuw witte zwartoog m/p",null,"07",5]
[16010900,"Spreeuw  nieuwe nog niet erkende mut. en mut.m/p",null,"07",5]
[16010999,"Spreeuw nieuwe mut. en comb. m/p (in standaard)",null,"07",5]
[16011001,"Merel bruin man",null,"07",5]
[16011002,"Merel bruin pop",null,"07",5]
[16011003,"Merel pastel man",null,"07",5]
[16011004,"Merel pastel pop",null,"07",5]
[16011005,"Merel satinet m/p",null,"07",5]
[16011006,"Merel albino m/p",null,"07",5]
[16011007,"Merel kleurkop m/p",null,"07",5]
[16011008,"Merel witte zwartoog m/p",null,"07",5]
[16011009,"Merel gepareld m/p",null,"07",5]
[16011900,"Merel nieuwe nog niet erkende mut. en comb. m/p",null,"07",5]
[16011999,"Merel nieuwe mut. en comb. m/p (in standaard)",null,"07",5]
[16012001,"Zanglijster bruin m/p",null,"07",5]
[16012002,"Zanglijster satinet m/p",null,"07",5]
[16012003,"Zanglijster SL ino m/p",null,"07",5]
[16012900,"Zanglijster nieuwe nog niet erkende mut. en comb. m/p",null,"07",5]
[16012999,"Zanglijster nieuwe mut. en comb. m/p (in standaard)",null,"07",5]
[16013900,"Ekster en Gaai nieuwe nog niet erkende mut. en comb. m/p",null,10,5]
[16013999,"Ekster en Gaai nieuwe mut. en comb. m/p (in standaard)",null,10,5]
[16014900,"Europese duiven nieuwe nog niet erkende mut. en comb. m/p",null,"09",3]
[16014999,"Europese duiven nieuwe mut. en comb. m/p (in standaard)",null,"09",3]
[16015900,"Patrijs nieuwe nog niet erkende mut. en comb. m/p",null,"09",3]
[16015999,"Patrijs nieuwe mut. en comb. m/p (in standaard)",null,"09",3]
[17002001,"Dennenmees",null,"07",5]
[17002002,"Koningsmees",null,"07",5]
[17002003,"Geelbuikmees",null,"07",5]
[17002004,"Indische kroonmees",null,"07",5]
[17002999,"Mees niet genoemde soorten",null,"07",5]
[17003001,"Roodflankbrilvogel",null,"07",5]
[17003002,"Gangesbrilvogel",null,"07",5]
[17003003,"Senegal brilvogel",null,"07",5]
[17003004,"Gele brilvogel",null,"07",5]
[17003005,"Kikuyubrilvogel",null,"07",5]
[17003999,"Brilvogel niet genoemde soorten",null,"07",5]
[17004999,"Honing- en nektar vogels niet genoemde soorten",null,"07",5]
[17005001,"Roodpootsuikervogel",null,"07",5]
[17005002,"Geelpootsuikervogel",null,"07",5]
[17005003,"Bananaquit",null,"07",5]
[17005999,"Suikervogels niet genoemde soorten",null,"07",5]
[17006999,"Organisten niet genoemde soorten",null,"07",5]
[17007001,"Blauwrugbergtangara",null,"07",5]
[17007002,"Veelkleurige tangara",null,"07",5]
[17007003,"Antillen dikbekje",null,"07",5]
[17007004,"Goudtangara",null,"07",5]
[17007005,"Roodnektangara",null,"07",5]
[17007006,"Palmtangara",null,"07",5]
[17007007,"Schranks tangara",null,"07",5]
[17007008,"Blauwzwarte tangara",null,"07",5]
[17007009,"Blauwgroene tangara",null,"07",5]
[17007999,"Tangara niet genoemde soorten",null,"07",5]
[17008001,"Roestbuiktimalie",null,"07",5]
[17008002,"Diadeemkuiftimalie",null,"07",5]
[17008003,"Strepentimalie",null,"07",5]
[17008004,"Keelstreeptimalie",null,"07",5]
[17008005,"Formosa timalie",null,"07",5]
[17008006,"Roestnektimalie",null,"07",5]
[17008007,"Zwartkintimalie",null,"07",5]
[17008008,"Zwartkinkuiftimalie",null,"07",5]
[17008009,"Zwartkoptimalie",null,"07",5]
[17008999,"Timalie niet genoemde soorten",null,"07",5]
[17009001,"Zilveroornachtegaal",null,"07",5]
[17009002,"Japanse nachtegaal",null,"07",5]
[17009003,"Blauwvleugelminla",null,"07",5]
[17009999,"Nagtegaal en minla niet genoemde soorten",null,"07",5]
[17010001,"Gewone scharlakenrode leloogvliegenvanger",null,"07",5]
[17010002,"Azuurvliegenvanger",null,"07",5]
[17010061,"Witkruinroodborst tapuit",null,"07",5]
[17010062,"Witkruintapuit",null,"07",5]
[17010063,"Sneeuwkruin roodborst tapuit",null,"07",5]
[17010999,"Vliegenvanger en Tapuit niet genoemde soorten",null,"07",5]
[17011001,"Cederpestvogel",null,"07",5]
[17011002,"Japanse pestvogel",null,"07",5]
[17011021,"Gevlekte palmlijster",null,"07",5]
[17011022,"Schamalijster",null,"07",5]
[17011023,"Dayallijster",null,"07",5]
[17011024,"Blauwe spotlijster",null,"07",5]
[17011025,"Grijze spotlijster",null,"07",5]
[17011026,"Amerikaanse spotlijster",null,"07",5]
[17011027,"Blauwkoprotslijster",null,"07",5]
[17011028,"Roodbuikrotslijster",null,"07",5]
[17011029,"Japanse lijster",null,"07",5]
[17011030,"Zwartborstlijster",null,"07",5]
[17011031,"Grijskaplijster",null,"07",5]
[17011032,"Witkoplijster",null,"07",5]
[17011033,"Grijskoplijster",null,"07",5]
[17011034,"Mexicaanse lijster",null,"07",5]
[17011035,"Damalijster",null,"07",5]
[17011036,"Witmaskerdamalijster",null,"07",5]
[17011037,"Kastanjeruglijster",null,"07",5]
[17011038,"Mexicaanse sialia",null,"07",5]
[17011039,"Roodkeel sialia",null,"07",5]
[17011999,"Lijster en sialia niet genoemde soorten",null,"07",5]
[17012001,"Dwergbuulbuul",null,"07",5]
[17012002,"Basilan Irena buulbuul",null,"07",5]
[17012003,"Irena buulbuul",null,"07",5]
[17012004,"Zwartkopbuulbuul",null,"07",5]
[17012005,"Roodoorbuulbuul",null,"07",5]
[17012006,"Witoorbuulbuul",null,"07",5]
[17012007,"Zwartkuifbuulbuul",null,"07",5]
[17012008,"Roodoogbuulbuul",null,"07",5]
[17012009,"Chinese buulbuul",null,"07",5]
[17012010,"Syrische buulbuul",null,"07",5]
[17012011,"Geelvoorhoofdbuulbuul",null,"07",5]
[17012012,"Grijsvoorhoofdbuulbuul",null,"07",5]
[17012999,"Buulbuul niet genoemde soorten (m.u.v. Kala buulbuul)",null,"07",5]
[17013001,"Goudvoorhoofdbladvogel",null,"07",5]
[17013002,"Blauwvleugelbladvogel",null,"07",5]
[17013003,"Groene bladvogel",null,"07",5]
[17013004,"Hardwick bladvogel",null,"07",5]
[17013005,"Grote groene bladvogel",null,"07",5]
[17013006,"Blauwmaskerbladvogel",null,"07",5]
[17013999,"Bladvogel niet genoemde soorten",null,"07",5]
[17014001,"Witkeelgaailijster",null,10,5]
[17014002,"Zwartbandgaailijster",null,10,5]
[17014003,"Zwartkeelzwartwanggaailijster",null,10,5]
[17014004,"Witborstgaailijster",null,10,5]
[17014005,"Bruine gaailijster",null,10,5]
[17014006,"Witwanggaailijster",null,10,5]
[17014007,"Bruinwang gaailijster",null,10,5]
[17014999,"GaaiLijster niet genoemde soorten",null,10,5]
[17015001,"Afrikaanse zwartkop wielewaal",null,10,5]
[17015002,"Indische wielewaal",null,10,5]
[17015003,"Wielewaalzanger",null,10,5]
[17015999,"Wielewaal niet genoemde soorten",null,10,5]
[17016001,"Geelkoptroepiaal",null,10,5]
[17016002,"Geelschoudertroepiaal",null,10,5]
[17016003,"Roodschoudertroepiaal",null,10,5]
[17016004,"Roodkoptroepiaal",null,10,5]
[17016005,"Witvleugeltroepiaal",null,10,5]
[17016006,"Oranje troepiaal",null,10,5]
[17016007,"Gele troepiaal",null,10,5]
[17016008,"Waglers troepiaal",null,10,5]
[17016999,"Troepiaal niet genoemde soorten",null,10,5]
[17017001,"Amethistglansspreeuw",null,10,5]
[17017002,"Groene glansspreeuw",null,10,5]
[17017003,"Blauwoorglansspreeuw",null,10,5]
[17017004,"Hildebrandt glansspreeuw",null,10,5]
[17017005,"Emeraldglasspreeuw",null,10,5]
[17017006,"Kaapse glansspreeuw",null,10,5]
[17017007,"Purperkopglansspreeuw",null,10,5]
[17017008,"Purperglansspreeuw",null,10,5]
[17017009,"Purperrugglansspreeuw",null,10,5]
[17017010,"Koningsglansspreeuw",null,10,5]
[17017011,"Prachtglansspreeuw",null,10,5]
[17017012,"Driekleurglansspreeuw",null,10,5]
[17017013,"Langstaartglansspreeuw",null,10,5]
[17017014,"Balispreeuw",null,10,5]
[17017015,"Kaalkopspreeuw",null,10,5]
[17017016,"Molineta spreeuw",null,10,5]
[17017017,"Jerdon spreeuw",null,10,5]
[17017018,"Grijze spreeuw",null,10,5]
[17017019,"Witkopspreeuw",null,10,5]
[17017020,"Grijskopspreeuw",null,10,5]
[17017021,"Pagodespreeuw",null,10,5]
[17017022,"Silkyspreeuw",null,10,5]
[17017023,"Mandarijnspreeuw",null,10,5]
[17017999,"Spreeuw niet genoemde soorten",null,10,5]
[17018001,"Grote Maina",null,10,5]
[17018002,"Kuifmaina",null,10,5]
[17018003,"Oevermaina",null,10,5]
[17018004,"Jungle maina",null,10,5]
[17018005,"Javaanse maina",null,10,5]
[17018006,"Goudkuifmaina",null,10,5]
[17018999,"Maina niet genoemde soorten (m.u.v. Herdermaine)",null,10,5]
[17019001,"Roodkruin scharrelaar",null,10,5]
[17019002,"Indische scharrelaar",null,10,5]
[17019003,"Vorkstaartscharrelaar",null,10,5]
[17019004,"Blauwbuikscharrelaar",null,10,5]
[17019005,"Blauwnekmuisvogel",null,10,5]
[17019999,"Scharrelaar en muisvogel niet genoemde soorten",null,10,5]
[17020001,"Grote beo",null,10,5]
[17020002,"Middelbeo",null,10,5]
[17020003,"Kleine beo",null,10,5]
[17020004,"Java beo",null,10,5]
[17020005,"Dumontbeo",null,10,5]
[17020999,"Beo niet genoemde soorten",null,10,5]
[17021001,"Formosa kitta",null,10,5]
[17021002,"Roodsnavelkitta",null,10,5]
[17021003,"Geelsnavelkitta",null,10,5]
[17021004,"Blauwe kitta",null,10,5]
[17021005,"Groene kitta",null,10,5]
[17021999,"Kitta niet genoemde soorten",null,10,5]
[17022001,"Braziliaanse zwarte specht",null,10,5]
[17022002,"Grote gevlekte specht",null,10,5]
[17022003,"Grijze specht",null,10,5]
[17022004,"Witte specht",null,10,5]
[17022999,"Specht niet genoemde soorten",null,10,5]
[17023001,"Amerikaanse blauwe gaai",null,10,5]
[17023002,"Azuurblauwe gaai",null,10,5]
[17023003,"Blauwenekgaai",null,10,5]
[17023004,"Zwartkuifgaai",null,10,5]
[17023005,"Witnekgaai",null,10,5]
[17023006,"Witstuitgaai",null,10,5]
[17023999,"Gaai niet genoemde soorten",null,10,5]
[17024001,"Malachiet ijsvogel",null,10,5]
[17024002,"Blauwvleugel ijsvogel",null,10,5]
[17024003,"Australische bosijsvogel",null,10,5]
[17024004,"Bruinkop ijsvogel",null,10,5]
[17024005,"Bruinrug ijsvogel",null,10,5]
[17024006,"Bosijsvogel",null,10,5]
[17024007,"Witborst ijsvogel",null,10,5]
[17024999,"Ijsvogel niet genoemde soorten",null,10,5]
[17025001,"Himalaya ekster",null,10,5]
[17025002,"Aziatische blauwe ekster",null,10,5]
[17025999,"Ekster niet genoemde soorten (geen europese soorten)",null,10,5]
[17026001,"Dubbelgetande baardvogel",null,10,5]
[17026002,"Gebaarde baardvogel",null,10,5]
[17026003,"Gespikkelde baardvogel",null,10,5]
[17026004,"Roodkopbaardvogel",null,10,5]
[17026005,"Toekanbaardvogel",null,10,5]
[17026999,"Baardvogel niet genoemde soorten",null,10,5]
[17027001,"Krodillenwachter",null,10,5]
[17027002,"Motmot",null,10,5]
[17027999,"Krokedillenwachter en Motmot niet genoemde soorten",null,10,5]
[17028001,"Groene hapvogel",null,10,5]
[17028002,"Prachtsmaragdbreedbek",null,10,5]
[17028003,"Smaragdgroene hapvogel",null,10,5]
[17028999,"Hap en breedbek  vogels niet genoemde soorten",null,10,5]
[17029001,"Groene bijeneter",null,10,5]
[17029002,"Witkeelbijeneter",null,10,5]
[17029003,"Witvoorhoofdbijeneter",null,10,5]
[17029999,"Bijeneter niet genoemde  soorten",null,10,5]
[17030001,"Blauwkeel arassari",null,10,5]
[17030002,"Groene arassari",null,10,5]
[17030003,"Roodstuit arassari",null,10,5]
[17030004,"Zwartnek arassari",null,10,5]
[17030005,"Krulkop arassari",null,10,5]
[17030006,"Guyana arassari",null,10,5]
[17030007,"Roodsnaveltoekan",null,10,5]
[17030008,"Groensnaveltoekan",null,10,5]
[17030009,"Toko toekan",null,10,5]
[17030010,"Zwavelborsttoekan",null,10,5]
[17030011,"Arieltoekan",null,10,5]
[17030012,"Dubbelhoornvogel",null,10,5]
[17030013,"Roodbruine neushoornvogel",null,10,5]
[17030014,"Maleise neushoornvogel",null,10,5]
[17030015,"Trompetneushoornvogel",null,10,5]
[17030016,"Roodsnaveltok",null,10,5]
[17030999,"Arassari, Toekan en Hoornvogel niet genoemde soorten",null,10,5]
[17031001,"Reuzentoerako",null,10,5]
[17031002,"Grijze toerako",null,10,5]
[17031003,"Lady Ross toerako",null,10,5]
[17031004,"Purpertoerako",null,10,5]
[17031005,"Violetschildtoerako",null,10,5]
[17031006,"Roodkuiftoerako",null,10,5]
[17031007,"Fischers toerako",null,10,5]
[17031008,"Hartlaubs toerako",null,10,5]
[17031009,"Witkuif toerako",null,10,5]
[17031010,"Livingstone toerako",null,10,5]
[17031011,"Buffons toerako",null,10,5]
[17031012,"Purperkuiftoerako",null,10,5]
[17031013,"Vuurtrogon",null,10,5]
[17031014,"Roodnektrogon",null,10,5]
[17031999,"Toerako en Trogon niet genoemde  soorten",null,10,5]
[17032001,"Roodbuikpitta",null,"09",5]
[17032002,"Blauwnekpitta",null,"09",5]
[17032003,"Prachtpitta",null,"09",5]
[17032004,"Blauwe cotinga",null,"09",5]
[17032999,"Pitta niet genoemde soorten",null,"09",5]
[18001001,"Standaard grasparkiet groen",null,"02",3]
[18002001,"Standaard grasparkiet D groen",null,"02",3]
[18002002,"Standaard grasparkiet DD groen",null,"02",3]
[18002003,"Standaard grasparkiet grijsgroen",null,"02",3]
[18002004,"Standaard grasparkiet violet groen",null,"02",3]
[18003001,"Standaard grasparkiet aqua",null,"02",3]
[18003002,"Standaard grasparkiet D aqua",null,"02",3]
[18003003,"Standaard grasparkiet DD aqua",null,"02",3]
[18003004,"Standaard grasparkiet grijs aqua",null,"02",3]
[18003005,"Standaard grasparkiet violet aqua",null,"02",3]
[18003006,"Standaard grasparkiet turquoise",null,"02",3]
[18003007,"Standaard grasparkiet D turquoise",null,"02",3]
[18003008,"Standaard grasparkiet DD turquoise",null,"02",3]
[18003009,"Standaard grasparkiet grijs turquoise",null,"02",3]
[18003010,"Standaard grasparkiet violet turquoise",null,"02",3]
[18003011,"Standaard grasparkiet geelmasker",null,"02",3]
[18003012,"Standaard grasparkiet D geelmasker",null,"02",3]
[18003013,"Standaard grasparkiet DD geelmasker",null,"02",3]
[18003014,"Standaard grasparkiet grijs geelmasker",null,"02",3]
[18003015,"Standaard grasparkiet violet geelmasker",null,"02",3]
[18004001,"Standaard grasparkiet blauw",null,"02",3]
[18004002,"Standaard grasparkiet D blauw",null,"02",3]
[18004003,"Standaard grasparkiet DD blauw",null,"02",3]
[18004004,"Standaard grasparkiet grijsblauw",null,"02",3]
[18004005,"Standaard grasparkiet violetblauw",null,"02",3]
[18005001,"Standaard grasparkiet cinnamon groen",null,"02",3]
[18005002,"Standaard grasparkiet cinnamon D groen",null,"02",3]
[18005003,"Standaard grasparkiet cinnamon DD groen",null,"02",3]
[18005004,"Standaard grasparkiet cinnamon grijsgroen",null,"02",3]
[18005005,"Standaard grasparkiet cinnamon violet groen",null,"02",3]
[18005006,"Standaard grasparkiet cinnamon aqua",null,"02",3]
[18005007,"Standaard grasparkiet cinnamon D Aqua",null,"02",3]
[18005008,"Standaard grasparkiet cinnamon DD aqua",null,"02",3]
[18005009,"Standaard grasparkiet cinnamon grijs aqua",null,"02",3]
[18005010,"Standaard grasparkiet cinnamon violet aqua",null,"02",3]
[18005011,"Standaard grasparkiet cinnamon turquoise",null,"02",3]
[18005012,"Standaard grasparkiet cinnamon D turquoise",null,"02",3]
[18005013,"Standaard grasparkiet cinnamon DD turquoise",null,"02",3]
[18005014,"Standaard grasparkiet cinnamon grijs turquoise",null,"02",3]
[18005015,"Standaard grasparkiet cinnamon violet turquoise",null,"02",3]
[18005016,"Standaard grasparkiet cinnamon geelmasker",null,"02",3]
[18005017,"Standaard grasparkiet cinnamon D Geelmasker",null,"02",3]
[18005018,"Standaard grasparkiet cinnamon DD geelmasker",null,"02",3]
[18005019,"Standaard grasparkiet cinnamon grijs geelmasker",null,"02",3]
[18005020,"Standaard grasparkiet cinnamon violet geelmasker",null,"02",3]
[18005021,"Standaard grasparkiet cinnamon blauw",null,"02",3]
[18005022,"Standaard grasparkiet cinnamon D blauw",null,"02",3]
[18005023,"Standaard grasparkiet cinnamon DD blauw",null,"02",3]
[18005024,"Standaard grasparkiet cinnamon grijsblauw",null,"02",3]
[18005025,"Standaard grasparkiet cinnamon violetblauw",null,"02",3]
[18006001,"Standaard grasparkiet pallid groen",null,"02",3]
[18006002,"Standaard grasparkiet pallid D groen",null,"02",3]
[18006003,"Standaard grasparkiet pallid DD groen",null,"02",3]
[18006004,"Standaard grasparkiet pallid grijsgroen",null,"02",3]
[18006005,"Standaard grasparkiet pallid violet groen",null,"02",3]
[18006006,"Standaard grasparkiet pallid aqua",null,"02",3]
[18006007,"Standaard grasparkiet pallid D aqua",null,"02",3]
[18006008,"Standaard grasparkiet pallid DD aqua",null,"02",3]
[18006009,"Standaard grasparkiet pallid grijs aqua",null,"02",3]
[18006010,"Standaard grasparkiet pallid violet aqua",null,"02",3]
[18006011,"Standaard grasparkiet pallid turquoise",null,"02",3]
[18006012,"Standaard grasparkiet pallid D turquoise",null,"02",3]
[18006013,"Standaard grasparkiet pallid DD turquoise",null,"02",3]
[18006014,"Standaard grasparkiet pallid grijs turquoise",null,"02",3]
[18006015,"Standaard grasparkiet pallid violet turquoise",null,"02",3]
[18006016,"Standaard grasparkiet pallid geelmasker",null,"02",3]
[18006017,"Standaard grasparkiet pallid D Geelmasker",null,"02",3]
[18006018,"Standaard grasparkiet pallid DD geelmasker",null,"02",3]
[18006019,"Standaard grasparkiet pallid grijs geelmasker",null,"02",3]
[18006020,"Standaard grasparkiet pallid violet geelmasker",null,"02",3]
[18006021,"Standaard grasparkiet pallid blauw",null,"02",3]
[18006022,"Standaard grasparkiet pallid D blauw",null,"02",3]
[18006023,"Standaard grasparkiet pallid DD blauw",null,"02",3]
[18006024,"Standaard grasparkiet pallid grijsblauw",null,"02",3]
[18006025,"Standaard grasparkiet pallid violetblauw",null,"02",3]
[18007001,"Standaard grasparkiet SL ino groen",null,"02",3]
[18007002,"Standaard grasparkiet SL ino aqua",null,"02",3]
[18007003,"Standaard grasparkiet SL ino turquoise",null,"02",3]
[18007004,"Standaard grasparkiet SL ino geelmasker",null,"02",3]
[18007005,"Standaard grasparkiet SL ino blauw",null,"02",3]
[18008001,"Standaard grasparkiet cinnamon-ino groen",null,"02",3]
[18008002,"Standaard grasparkiet cinnamon-ino aqua",null,"02",3]
[18008003,"Standaard grasparkiet cinnamon-ino turquoise",null,"02",3]
[18008004,"Standaard grasparkiet cinnamon-ino geelmasker",null,"02",3]
[18008005,"Standaard grasparkiet cinnamon-ino blauw",null,"02",3]
[18008006,"Standaard grasparkiet opaline-cinnamon-ino groen",null,"02",3]
[18008007,"Standaard grasparkiet opaline-cinnamon-ino aqua",null,"02",3]
[18008008,"Standaard grasparkiet opaline-cinnamon-ino turquoise",null,"02",3]
[18008009,"Standaard grasparkiet opaline-cinnamon-ino geelmasker",null,"02",3]
[18008010,"Standaard grasparkiet opaline-cinnamon-ino blauw",null,"02",3]
[18009001,"Standaard grasparkiet EF spangle groen",null,"02",3]
[18009002,"Standaard grasparkiet EF spangle D groen",null,"02",3]
[18009003,"Standaard grasparkiet EF spangle DD groen",null,"02",3]
[18009004,"Standaard grasparkiet EF spangle grijsgroen",null,"02",3]
[18009005,"Standaard grasparkiet EF spangle violet groen",null,"02",3]
[18009006,"Standaard grasparkiet EF spangle aqua",null,"02",3]
[18009007,"Standaard grasparkiet EF spangle D aqua",null,"02",3]
[18009008,"Standaard grasparkiet EF spangle DD aqua",null,"02",3]
[18009009,"Standaard grasparkiet EF spangle grijs aqua",null,"02",3]
[18009010,"Standaard grasparkiet EF spangle violet aqua",null,"02",3]
[18009011,"Standaard grasparkiet EF spangle turquoise",null,"02",3]
[18009012,"Standaard grasparkiet EF spangle D turquoise",null,"02",3]
[18009013,"Standaard grasparkiet EF spangle DD turquoise",null,"02",3]
[18009014,"Standaard grasparkiet EF spangle grijs turquoise",null,"02",3]
[18009015,"Standaard grasparkiet EF spangle violet turquoise",null,"02",3]
[18009016,"Standaard grasparkiet EF spangle geelmasker",null,"02",3]
[18009017,"Standaard grasparkiet EF spangle D geelmasker",null,"02",3]
[18009018,"Standaard grasparkiet EF spangle DD geelmasker",null,"02",3]
[18009019,"Standaard grasparkiet EF spangle grijs geelmasker",null,"02",3]
[18009020,"Standaard grasparkiet EF spangle violet geelmasker",null,"02",3]
[18009021,"Standaard grasparkiet EF spangle blauw",null,"02",3]
[18009022,"Standaard grasparkiet EF spangle D blauw",null,"02",3]
[18009023,"Standaard grasparkiet EF spangle DD blauw",null,"02",3]
[18009024,"Standaard grasparkiet EF spangle grijsblauw",null,"02",3]
[18009025,"Standaard grasparkiet EF spangle violetblauw",null,"02",3]
[18009026,"Standaard grasparkiet EF spangle cinnamon groen",null,"02",3]
[18009027,"Standaard grasparkiet EF spangle cinnamon D groen",null,"02",3]
[18009028,"Standaard grasparkiet EF spangle cinnamon DD groen",null,"02",3]
[18009029,"Standaard grasparkiet EF spangle cinnamon grijsgroen",null,"02",3]
[18009030,"Standaard grasparkiet EF spangle cinnamon violet groen",null,"02",3]
[18009031,"Standaard grasparkiet EF spangle cinnamon aqua",null,"02",3]
[18009032,"Standaard grasparkiet EF spangle cinnamon D Aqua",null,"02",3]
[18009033,"Standaard grasparkiet EF spangle cinnamon DD aqua",null,"02",3]
[18009034,"Standaard grasparkiet EF spangle cinnamon grijs aqua",null,"02",3]
[18009035,"Standaard grasparkiet EF spangle cinnamon violet aqua",null,"02",3]
[18009036,"Standaard grasparkiet EF spangle cinnamon turquoise",null,"02",3]
[18009037,"Standaard grasparkiet EF spangle cinnamon D turquoise",null,"02",3]
[18009038,"Standaard grasparkiet EF spangle cinnamon DD turquoise",null,"02",3]
[18009039,"Standaard grasparkiet EF spangle cinnamon grijs turquoise",null,"02",3]
[18009040,"Standaard grasparkiet EF spangle cinnamon violet turquoise",null,"02",3]
[18009041,"Standaard grasparkiet EF spangle cinnamon geelmasker",null,"02",3]
[18009042,"Standaard grasparkiet EF spangle cinnamon D geelmasker",null,"02",3]
[18009043,"Standaard grasparkiet EF spangle cinnamon DD geelmasker",null,"02",3]
[18009044,"Standaard grasparkiet EF spangle cinnamon grijs geelmasker",null,"02",3]
[18009045,"Standaard grasparkiet EF spangle cinnamon violet geelmasker",null,"02",3]
[18009046,"Standaard grasparkiet EF spangle cinnamon blauw",null,"02",3]
[18009047,"Standaard grasparkiet EF spangle cinnamon D blauw",null,"02",3]
[18009048,"Standaard grasparkiet EF spangle cinnamon DD blauw",null,"02",3]
[18009049,"Standaard grasparkiet EF spangle cinnamon grijsblauw",null,"02",3]
[18009050,"Standaard grasparkiet EF spangle cinnamon violetblauw",null,"02",3]
[18009051,"Standaard grasparkiet cleartail groenserie",null,"02",3]
[18009052,"Standaard grasparkiet cleartail aquaserie",null,"02",3]
[18009053,"Standaard grasparkiet cleartail turquoiseserie",null,"02",3]
[18009054,"Standaard grasparkiet cleartail geelmaskerserie",null,"02",3]
[18009055,"Standaard grasparkiet cleartail blauwserie",null,"02",3]
[18010001,"Standaard grasparkiet grijsvleugel groen",null,"02",3]
[18010002,"Standaard grasparkiet grijsvleugel D groen",null,"02",3]
[18010003,"Standaard grasparkiet grijsvleugel DD groen",null,"02",3]
[18010004,"Standaard grasparkiet grijsvleugel grijsgroen",null,"02",3]
[18010005,"Standaard grasparkiet grijsvleugel violet groen",null,"02",3]
[18010006,"Standaard grasparkiet grijsvleugel aqua",null,"02",3]
[18010007,"Standaard grasparkiet grijsvleugel D Aqua",null,"02",3]
[18010008,"Standaard grasparkiet grijsvleugel DD aqua",null,"02",3]
[18010009,"Standaard grasparkiet grijsvleugel grijs aqua",null,"02",3]
[18010010,"Standaard grasparkiet grijsvleugel violet aqua",null,"02",3]
[18010011,"Standaard grasparkiet grijsvleugel turquoise",null,"02",3]
[18010012,"Standaard grasparkiet grijsvleugel D turquoise",null,"02",3]
[18010013,"Standaard grasparkiet grijsvleugel DD turquoise",null,"02",3]
[18010014,"Standaard grasparkiet grijsvleugel grijs turquoise",null,"02",3]
[18010015,"Standaard grasparkiet grijsvleugel violet turquoise",null,"02",3]
[18010016,"Standaard grasparkiet grijsvleugel geelmasker",null,"02",3]
[18010017,"Standaard grasparkiet grijsvleugel D geelmasker",null,"02",3]
[18010018,"Standaard grasparkiet grijsvleugel DD geelmasker",null,"02",3]
[18010019,"Standaard grasparkiet grijsvleugel grijs geelmasker",null,"02",3]
[18010020,"Standaard grasparkiet grijsvleugel violet geelmasker",null,"02",3]
[18010021,"Standaard grasparkiet grijsvleugel blauw",null,"02",3]
[18010022,"Standaard grasparkiet grijsvleugel D blauw",null,"02",3]
[18010023,"Standaard grasparkiet grijsvleugel DD blauw",null,"02",3]
[18010024,"Standaard grasparkiet grijsvleugel grijsblauw",null,"02",3]
[18010025,"Standaard grasparkiet grijsvleugel violetblauw",null,"02",3]
[18011001,"Standaard grasparkiet blankvleugel groen",null,"02",3]
[18011002,"Standaard grasparkiet blankvleugel D groen",null,"02",3]
[18011003,"Standaard grasparkiet blankvleugel DD groen",null,"02",3]
[18011004,"Standaard grasparkiet blankvleugel grijsgroen",null,"02",3]
[18011005,"Standaard grasparkiet blankvleugel violet groen",null,"02",3]
[18011006,"Standaard grasparkiet blankvleugel aqua",null,"02",3]
[18011007,"Standaard grasparkiet blankvleugel D Aqua",null,"02",3]
[18011008,"Standaard grasparkiet blankvleugel DD aqua",null,"02",3]
[18011009,"Standaard grasparkiet blankvleugel grijs aqua",null,"02",3]
[18011010,"Standaard grasparkiet blankvleugel violet aqua",null,"02",3]
[18011011,"Standaard grasparkiet blankvleugel turquoise",null,"02",3]
[18011012,"Standaard grasparkiet blankvleugel D turquoise",null,"02",3]
[18011013,"Standaard grasparkiet blankvleugel DD turquoise",null,"02",3]
[18011014,"Standaard grasparkiet blankvleugel grijs turquoise",null,"02",3]
[18011015,"Standaard grasparkiet blankvleugel violet turquoise",null,"02",3]
[18011016,"Standaard grasparkiet blankvleugel geelmasker",null,"02",3]
[18011017,"Standaard grasparkiet blankvleugel D geelmasker",null,"02",3]
[18011018,"Standaard grasparkiet blankvleugel DD geelmasker",null,"02",3]
[18011019,"Standaard grasparkiet blankvleugel grijs geelmasker",null,"02",3]
[18011020,"Standaard grasparkiet blankvleugel violet geelmasker",null,"02",3]
[18011021,"Standaard grasparkiet blankvleugel blauw",null,"02",3]
[18011022,"Standaard grasparkiet blankvleugel D blauw",null,"02",3]
[18011023,"Standaard grasparkiet blankvleugel DD blauw",null,"02",3]
[18011024,"Standaard grasparkiet blankvleugel grijsblauw",null,"02",3]
[18011025,"Standaard grasparkiet blankvleugel violetblauw",null,"02",3]
[18012001,"Standaard grasparkiet dilute groen",null,"02",3]
[18012002,"Standaard grasparkiet dilute D groen",null,"02",3]
[18012003,"Standaard grasparkiet dilute DD groen",null,"02",3]
[18012004,"Standaard grasparkiet dilute grijsgroen",null,"02",3]
[18012005,"Standaard grasparkiet dilute violet groen",null,"02",3]
[18012006,"Standaard grasparkiet dilute aqua",null,"02",3]
[18012007,"Standaard grasparkiet dilute D aqua",null,"02",3]
[18012008,"Standaard grasparkiet dilute DD aqua",null,"02",3]
[18012009,"Standaard grasparkiet dilute grijs aqua",null,"02",3]
[18012010,"Standaard grasparkiet dilute violet aqua",null,"02",3]
[18012011,"Standaard grasparkiet dilute turquoise",null,"02",3]
[18012012,"Standaard grasparkiet dilute D turquoise",null,"02",3]
[18012013,"Standaard grasparkiet dilute DD turquoise",null,"02",3]
[18012014,"Standaard grasparkiet dilute grijs turquoise",null,"02",3]
[18012015,"Standaard grasparkiet dilute violet turquoise",null,"02",3]
[18012016,"Standaard grasparkiet dilute geelmasker",null,"02",3]
[18012017,"Standaard grasparkiet dilute D geelmasker",null,"02",3]
[18012018,"Standaard grasparkiet dilute DD geelmasker",null,"02",3]
[18012019,"Standaard grasparkiet dilute grijs geelmasker",null,"02",3]
[18012020,"Standaard grasparkiet dilute violet geelmasker",null,"02",3]
[18012021,"Standaard grasparkiet dilute blauw",null,"02",3]
[18012022,"Standaard grasparkiet dilute D blauw",null,"02",3]
[18012023,"Standaard grasparkiet dilute DD blauw",null,"02",3]
[18012024,"Standaard grasparkiet dilute grijsblauw",null,"02",3]
[18012025,"Standaard grasparkiet dilute violetblauw",null,"02",3]
[18013001,"Standaard grasparkiet bronze fallow groen",null,"02",3]
[18013002,"Standaard grasparkiet bronze fallow D groen",null,"02",3]
[18013003,"Standaard grasparkiet bronze fallow DD groen",null,"02",3]
[18013004,"Standaard grasparkiet bronze fallow grijsgroen",null,"02",3]
[18013005,"Standaard grasparkiet bronze fallow violet groen",null,"02",3]
[18013006,"Standaard grasparkiet bronze fallow aqua",null,"02",3]
[18013007,"Standaard grasparkiet bronze fallow D aqua",null,"02",3]
[18013008,"Standaard grasparkiet bronze fallow DD aqua",null,"02",3]
[18013009,"Standaard grasparkiet bronze fallow gijs aqua",null,"02",3]
[18013010,"Standaard grasparkiet bronze fallow violet aqua",null,"02",3]
[18013011,"Standaard grasparkiet bronze fallow turquoise",null,"02",3]
[18013012,"Standaard grasparkiet bronze fallow D turquoise",null,"02",3]
[18013013,"Standaard grasparkiet bronze fallow DD turquoise",null,"02",3]
[18013014,"Standaard grasparkiet bronze  fallow rec.grijs turquoise",null,"02",3]
[18013015,"Standaard grasparkiet bronze fallow violet turquoise",null,"02",3]
[18013016,"Standaard grasparkiet bronze fallow geelmasker",null,"02",3]
[18013017,"Standaard grasparkiet bronze fallow D geelmasker",null,"02",3]
[18013018,"Standaard grasparkiet bronze fallow DD geelmasker",null,"02",3]
[18013019,"Standaard grasparkiet bronze  fallow rec.grijs geelmasker",null,"02",3]
[18013020,"Standaard grasparkiet bronze fallow violet geelmasker",null,"02",3]
[18013021,"Standaard grasparkiet bronze fallow blauw",null,"02",3]
[18013022,"Standaard grasparkiet bronze fallow D blauw",null,"02",3]
[18013023,"Standaard grasparkiet bronze fallow DD blauw",null,"02",3]
[18013024,"Standaard grasparkiet bronze  fallow rec.grijsblauw",null,"02",3]
[18013025,"Standaard grasparkiet bronze fallow violetblauw",null,"02",3]
[18013026,"Standaard grasparkiet pale fallow groen serie",null,"02",3]
[18013027,"Standaard grasparkiet pale fallow aqua serie",null,"02",3]
[18013028,"Standaard grasparkiet pale fallow turquoise serie",null,"02",3]
[18013029,"Standaard grasparkiet pale fallow geelmasker serie",null,"02",3]
[18013030,"Standaard grasparkiet pale fallow blauw serie",null,"02",3]
[18014001,"Standaard grasparkiet dom. bont groen serie (incl. opaline en/of cinnamon)",null,"02",3]
[18014002,"Standaard grasparkiet dom. bont aqua serie (incl. opaline en/of cinnamon)",null,"02",3]
[18014003,"Standaard grasparkiet dom. bont turquoise serie (incl. opaline en/of cinnamon)",null,"02",3]
[18014004,"Standaard grasparkiet dom. bont geelmasker serie (incl. opaline en/of cinnamon)",null,"02",3]
[18014005,"Standaard grasparkiet dom. bont blauw serie (incl. opaline en/of cinnamon)",null,"02",3]
[18014006,"Standaard grasparkiet dom. bont klaarpen groen serie (incl. opal.e/o Cinn.)",null,"02",3]
[18014007,"Standaard grasparkiet dom. bont  klaarpen aqua serie (incl. opal.e/o Cinn.)",null,"02",3]
[18014008,"Standaard grasparkiet dom. bont  klaarpen turquoise serie (incl. opal.e/o Cinn.)",null,"02",3]
[18014009,"Standaard grasparkiet dom. bont  klaarpen geelmasker serie (incl.opal.e/o Cinn.)",null,"02",3]
[18014010,"Standaard grasparkiet dom. bont  klaarpen blauw serie (incl. opal.e/o Cinn.)",null,"02",3]
[18014011,"Standaard grasparkiet hollands bont groen serie (incl. opaline en/of cinnamon)",null,"02",3]
[18014012,"Standaard grasparkiet hollands bont aqua serie (incl. opaline en/of cinnamon)",null,"02",3]
[18014013,"Standaard grasparkiet hollands bont turquoise serie (incl. opal.e/o Cinn.)",null,"02",3]
[18014014,"Standaard grasparkiet hollands bont geelmasker serie (incl. opal.e/o Cinn.)",null,"02",3]
[18014015,"Standaard grasparkiet hollands bont blauw serie (incl. opaline en/of cinnamon)",null,"02",3]
[18015001,"Standaard grasparkiet recessief bont groen serie  (incl. opal.e/o Cinn.)",null,"02",3]
[18015002,"Standaard grasparkiet recessief bont aqua serie  (incl. opaline en/ of cinnamon)",null,"02",3]
[18015003,"Standaard grasparkiet recessief bont turquoise serie  (incl. opal.e/o Cinn.)",null,"02",3]
[18015004,"Standaard grasparkiet recessief bont geelmasker serie  (incl. opal.e/o Cinn.)",null,"02",3]
[18015005,"Standaard grasparkiet recessief bont blauw serie  (incl. opal.e/o Cinn.)",null,"02",3]
[18016001,"Standaard grasparkiet opaline groen",null,"02",3]
[18016002,"Standaard grasparkiet opaline D groen",null,"02",3]
[18016003,"Standaard grasparkiet opaline DD groen",null,"02",3]
[18016004,"Standaard grasparkiet opaline grijsgroen",null,"02",3]
[18016005,"Standaard grasparkiet opaline violet groen",null,"02",3]
[18017001,"Standaard grasparkiet opaline aqua",null,"02",3]
[18017002,"Standaard grasparkiet opaline D aqua",null,"02",3]
[18017003,"Standaard grasparkiet opaline DD aqua",null,"02",3]
[18017004,"Standaard grasparkiet opaline grijs aqua",null,"02",3]
[18017005,"Standaard grasparkiet opaline violet aqua",null,"02",3]
[18017006,"Standaard grasparkiet opaline turquoise",null,"02",3]
[18017007,"Standaard grasparkiet opaline D turquoise",null,"02",3]
[18017008,"Standaard grasparkiet opaline DD turquoise",null,"02",3]
[18017009,"Standaard grasparkiet opaline grijs turquoise",null,"02",3]
[18017010,"Standaard grasparkiet opaline violet turquoise",null,"02",3]
[18017011,"Standaard grasparkiet opaline geelmasker",null,"02",3]
[18017012,"Standaard grasparkiet opaline D geelmasker",null,"02",3]
[18017013,"Standaard grasparkiet opaline DD geelmasker",null,"02",3]
[18017014,"Standaard grasparkiet opaline grijs geelmasker",null,"02",3]
[18017015,"Standaard grasparkiet opaline violet geelmasker",null,"02",3]
[18018001,"Standaard grasparkiet opaline blauw",null,"02",3]
[18018002,"Standaard grasparkiet opaline D blauw",null,"02",3]
[18018003,"Standaard grasparkiet opaline DD blauw",null,"02",3]
[18018004,"Standaard grasparkiet opaline grijsblauw",null,"02",3]
[18018005,"Standaard grasparkiet opaline violetblauw",null,"02",3]
[18019001,"Standaard grasparkiet opaline-cinnamon groen",null,"02",3]
[18019002,"Standaard grasparkiet opaline-cinnamon D groen",null,"02",3]
[18019003,"Standaard grasparkiet opaline-cinnamon DD groen",null,"02",3]
[18019004,"Standaard grasparkiet opaline-cinnamon grijsgroen",null,"02",3]
[18019005,"Standaard grasparkiet opaline-cinnamon violet groen",null,"02",3]
[18019006,"Standaard grasparkiet opaline-cinnamon aqua",null,"02",3]
[18019007,"Standaard grasparkiet opaline-cinnamon D Aqua",null,"02",3]
[18019008,"Standaard grasparkiet opaline-cinnamon DD aqua",null,"02",3]
[18019009,"Standaard grasparkiet opaline-cinnamon grijs aqua",null,"02",3]
[18019010,"Standaard grasparkiet opaline-cinnamon violet aqua",null,"02",3]
[18019011,"Standaard grasparkiet opaline-cinnamon turquoise",null,"02",3]
[18019012,"Standaard grasparkiet opaline-cinnamon D turquoise",null,"02",3]
[18019013,"Standaard grasparkiet opaline-cinnamon DD turquoise",null,"02",3]
[18019014,"Standaard grasparkiet opaline-cinnamon grijs turquoise",null,"02",3]
[18019015,"Standaard grasparkiet opaline-cinnamon violet turquoise",null,"02",3]
[18019016,"Standaard grasparkiet opaline-cinnamon geelmasker",null,"02",3]
[18019017,"Standaard grasparkiet opaline-cinnamon D Geelmasker",null,"02",3]
[18019018,"Standaard grasparkiet opaline-cinnamon DD geelmasker",null,"02",3]
[18019019,"Standaard grasparkiet opaline-cinnamon grijs geelmasker",null,"02",3]
[18019020,"Standaard grasparkiet opaline-cinnamon violet geelmasker",null,"02",3]
[18019021,"Standaard grasparkiet opaline-cinnamon blauw",null,"02",3]
[18019022,"Standaard grasparkiet opaline-cinnamon D blauw",null,"02",3]
[18019023,"Standaard grasparkiet opaline-cinnamon DD blauw",null,"02",3]
[18019024,"Standaard grasparkiet opaline-cinnamon grijsblauw",null,"02",3]
[18019025,"Standaard grasparkiet opaline-cinnamon violetblauw",null,"02",3]
[18020001,"Standaard grasparkiet opaline-pallid groen",null,"02",3]
[18020002,"Standaard grasparkiet opaline-pallid D groen",null,"02",3]
[18020003,"Standaard grasparkiet opaline-pallid DD groen",null,"02",3]
[18020004,"Standaard grasparkiet opaline-pallid grijsgroen",null,"02",3]
[18020005,"Standaard grasparkiet opaline-pallid violet groen",null,"02",3]
[18020006,"Standaard grasparkiet opaline-pallid aqua",null,"02",3]
[18020007,"Standaard grasparkiet opaline-pallid D aqua",null,"02",3]
[18020008,"Standaard grasparkiet opaline-pallid DD aqua",null,"02",3]
[18020009,"Standaard grasparkiet opaline-pallid grijs aqua",null,"02",3]
[18020010,"Standaard grasparkiet opaline-pallid violet aqua",null,"02",3]
[18020011,"Standaard grasparkiet opaline-pallid turquoise",null,"02",3]
[18020012,"Standaard grasparkiet opaline-pallid D turquoise",null,"02",3]
[18020013,"Standaard grasparkiet opaline-pallid DD turquoise",null,"02",3]
[18020014,"Standaard grasparkiet opaline-pallid grijs turquoise",null,"02",3]
[18020015,"Standaard grasparkiet opaline-pallid violet turquoise",null,"02",3]
[18020016,"Standaard grasparkiet opaline-pallid geelmasker",null,"02",3]
[18020017,"Standaard grasparkiet opaline-pallid D Geelmasker",null,"02",3]
[18020018,"Standaard grasparkiet opaline-pallid DD geelmasker",null,"02",3]
[18020019,"Standaard grasparkiet opaline-pallid grijs geelmasker",null,"02",3]
[18020020,"Standaard grasparkiet opaline-pallid violet geelmasker",null,"02",3]
[18020021,"Standaard grasparkiet opaline-pallid blauw",null,"02",3]
[18020022,"Standaard grasparkiet opaline-pallid D blauw",null,"02",3]
[18020023,"Standaard grasparkiet opaline-pallid DD blauw",null,"02",3]
[18020024,"Standaard grasparkiet opaline-pallid grijsblauw",null,"02",3]
[18020025,"Standaard grasparkiet opaline-pallid violetblauw",null,"02",3]
[18021001,"Standaard grasparkiet opaline grijsvleugel groen serie",null,"02",3]
[18021002,"Standaard grasparkiet opaline grijsvleugel aqua serie",null,"02",3]
[18021003,"Standaard grasparkiet opaline grijsvleugel turquoise serie",null,"02",3]
[18021004,"Standaard grasparkiet opaline grijsvleugel geelmasker serie",null,"02",3]
[18021005,"Standaard grasparkiet opaline grijsvleugel blauw serie",null,"02",3]
[18021006,"Standaard grasparkiet opaline blankvleugel groen serie",null,"02",3]
[18021007,"Standaard grasparkiet opaline blankvleugel aqua serie",null,"02",3]
[18021008,"Standaard grasparkiet opaline blankvleugel turquoise serie",null,"02",3]
[18021009,"Standaard grasparkiet opaline blankvleugel geelmasker serie",null,"02",3]
[18021010,"Standaard grasparkiet opaline blankvleugel blauw serie",null,"02",3]
[18021011,"Standaard grasparkiet opaline dilute groen serie",null,"02",3]
[18021012,"Standaard grasparkiet opaline dilute aqua serie",null,"02",3]
[18021013,"Standaard grasparkiet opaline dilute turquoise serie",null,"02",3]
[18021014,"Standaard grasparkiet opaline dilute geelmasker serie",null,"02",3]
[18021015,"Standaard grasparkiet opaline dilute blauw serie",null,"02",3]
[18022001,"Standaard grasparkiet opaline bronze fallow groen serie",null,"02",3]
[18022002,"Standaard grasparkiet opaline bronze fallow aqua serie",null,"02",3]
[18022003,"Standaard grasparkiet opaline bronze fallow turquoise serie",null,"02",3]
[18022004,"Standaard grasparkiet opaline bronze fallow geelmasker serie",null,"02",3]
[18022005,"Standaard grasparkiet opaline bronze fallow blauw serie",null,"02",3]
[18022006,"Standaard grasparkiet opaline pale fallow groen serie",null,"02",3]
[18022007,"Standaard grasparkiet opaline pale fallow aqua serie",null,"02",3]
[18022008,"Standaard grasparkiet opaline pale fallow turquoise serie",null,"02",3]
[18022009,"Standaard grasparkiet opaline pale fallow geelmasker serie",null,"02",3]
[18022010,"Standaard grasparkiet opaline pale fallow blauw serie",null,"02",3]
[18022011,"Standaard grasparkiet opaline EF spangle groen serie",null,"02",3]
[18022012,"Standaard grasparkiet opaline EF spangle aqua serie",null,"02",3]
[18022013,"Standaard grasparkiet opaline EF spangle turquoise serie",null,"02",3]
[18022014,"Standaard grasparkiet opaline EF spangle geelmasker serie",null,"02",3]
[18022015,"Standaard grasparkiet opaline EF spangle blauw serie",null,"02",3]
[18023001,"Standaard grasparkiet DF spangle groen",null,"02",3]
[18023002,"Standaard grasparkiet DF spangle aqua",null,"02",3]
[18023003,"Standaard grasparkiet DF spangle turquoise",null,"02",3]
[18023004,"Standaard grasparkiet DF spangle geelmasker",null,"02",3]
[18023005,"Standaard grasparkiet DF spangle blauw",null,"02",3]
[18023006,"Standaard grasparkiet DEC groen",null,"02",3]
[18023007,"Standaard grasparkiet DEC aqua",null,"02",3]
[18023008,"Standaard grasparkiet DEC turquoise",null,"02",3]
[18023009,"Standaard grasparkiet DEC geelmasker",null,"02",3]
[18023010,"Standaard grasparkiet DEC blauw",null,"02",3]
[18024001,"Standaard grasparkiet alle puntkuiven",null,"02",3]
[18024002,"Standaard grasparkiet alle halve rozet kuiven",null,"02",3]
[18024003,"Standaard grasparkiet alle rozet kuiven",null,"02",3]
[18025999,"Standaard grasparkiet niet genoemde easley clearbody kleurslagen (incl.opaline)",null,"02",3]
[18026999,"Standaard grasparkiet niet genoemde saddleback kleurslagen (incl.opaline)  ",null,"02",3]
[18027999,"Standaard grasparkiet niet genoemde blackwing kleurslagen (incl.opaline)",null,"02",3]
[18028001,"Standaard grasparkiet antraciet blauw serie (incl. opaline en / of cinnamon)",null,"02",3]
[18028002,"Standaard grasparkiet slate blauw (incl. opaline en / of cinnamon)",null,"02",3]
[18028003,"Standaard grasparkiet slate violetblauw (incl. opaline en / of cinnamon)",null,"02",3]
[18190900,"Standaard grasparkiet nieuwe nog niet erkende mut. en comb. m/p",null,"02",3]
[18190999,"Standaard grasparkiet nieuwe mut. en comb. m/p (in standaard)",null,"02",3]
[19001001,"Kleurgrasparkiet groen",null,"02",3]
[19002001,"Kleurgrasparkiet D groen",null,"02",3]
[19002002,"Kleurgrasparkiet DD groen",null,"02",3]
[19002003,"Kleurgrasparkiet grijsgroen",null,"02",3]
[19002004,"Kleurgrasparkiet violet groen",null,"02",3]
[19003001,"Kleurgrasparkiet aqua",null,"02",3]
[19003002,"Kleurgrasparkiet D aqua",null,"02",3]
[19003003,"Kleurgrasparkiet DD aqua",null,"02",3]
[19003004,"Kleurgrasparkiet grijs aqua",null,"02",3]
[19003005,"Kleurgrasparkiet violet aqua",null,"02",3]
[19003006,"Kleurgrasparkiet turquoise",null,"02",3]
[19003007,"Kleurgrasparkiet D turquoise",null,"02",3]
[19003008,"Kleurgrasparkiet DD turquoise",null,"02",3]
[19003009,"Kleurgrasparkiet grijs turquoise",null,"02",3]
[19003010,"Kleurgrasparkiet violet turquoise",null,"02",3]
[19003011,"Kleurgrasparkiet geelmasker",null,"02",3]
[19003012,"Kleurgrasparkiet D geelmasker",null,"02",3]
[19003013,"Kleurgrasparkiet DD geelmasker",null,"02",3]
[19003014,"Kleurgrasparkiet grijs geelmasker",null,"02",3]
[19003015,"Kleurgrasparkiet violet geelmasker",null,"02",3]
[19004001,"Kleurgrasparkiet blauw",null,"02",3]
[19004002,"Kleurgrasparkiet D blauw",null,"02",3]
[19004003,"Kleurgrasparkiet DD blauw",null,"02",3]
[19004004,"Kleurgrasparkiet grijsblauw",null,"02",3]
[19004005,"Kleurgrasparkiet violetblauw",null,"02",3]
[19005001,"Kleurgrasparkiet cinnamon groen",null,"02",3]
[19005002,"Kleurgrasparkiet cinnamon D groen",null,"02",3]
[19005003,"Kleurgrasparkiet cinnamon DD groen",null,"02",3]
[19005004,"Kleurgrasparkiet cinnamon grijsgroen",null,"02",3]
[19005005,"Kleurgrasparkiet cinnamon violet groen",null,"02",3]
[19005006,"Kleurgrasparkiet cinnamon aqua",null,"02",3]
[19005007,"Kleurgrasparkiet cinnamon D Aqua",null,"02",3]
[19005008,"Kleurgrasparkiet cinnamon DD aqua",null,"02",3]
[19005009,"Kleurgrasparkiet cinnamon grijs aqua",null,"02",3]
[19005010,"Kleurgrasparkiet cinnamon violet aqua",null,"02",3]
[19005011,"Kleurgrasparkiet cinnamon turquoise",null,"02",3]
[19005012,"Kleurgrasparkiet cinnamon D turquoise",null,"02",3]
[19005013,"Kleurgrasparkiet cinnamon DD turquoise",null,"02",3]
[19005014,"Kleurgrasparkiet cinnamon grijs turquoise",null,"02",3]
[19005015,"Kleurgrasparkiet cinnamon violet turquoise",null,"02",3]
[19005016,"Kleurgrasparkiet cinnamon geelmasker",null,"02",3]
[19005017,"Kleurgrasparkiet cinnamon D geelmasker",null,"02",3]
[19005018,"Kleurgrasparkiet cinnamon DD geelmasker",null,"02",3]
[19005019,"Kleurgrasparkiet cinnamon grijs geelmasker",null,"02",3]
[19005020,"Kleurgrasparkiet cinnamon violet geelmasker",null,"02",3]
[19005021,"Kleurgrasparkiet cinnamon blauw",null,"02",3]
[19005022,"Kleurgrasparkiet cinnamon D blauw",null,"02",3]
[19005023,"Kleurgrasparkiet cinnamon DD blauw",null,"02",3]
[19005024,"Kleurgrasparkiet cinnamon grijsblauw",null,"02",3]
[19005025,"Kleurgrasparkiet cinnamon violetblauw",null,"02",3]
[19006001,"Kleurgrasparkiet pallid groen",null,"02",3]
[19006002,"Kleurgrasparkiet pallid D groen",null,"02",3]
[19006003,"Kleurgrasparkiet pallid DD groen",null,"02",3]
[19006004,"Kleurgrasparkiet pallid grijsgroen",null,"02",3]
[19006005,"Kleurgrasparkiet pallid violet groen",null,"02",3]
[19006006,"Kleurgrasparkiet pallid aqua",null,"02",3]
[19006007,"Kleurgrasparkiet pallid D aqua",null,"02",3]
[19006008,"Kleurgrasparkiet pallid DD aqua",null,"02",3]
[19006009,"Kleurgrasparkiet pallid grijs aqua",null,"02",3]
[19006010,"Kleurgrasparkiet pallid violet aqua",null,"02",3]
[19006011,"Kleurgrasparkiet pallid turquoise",null,"02",3]
[19006012,"Kleurgrasparkiet pallid D turquoise",null,"02",3]
[19006013,"Kleurgrasparkiet pallid DD turquoise",null,"02",3]
[19006014,"Kleurgrasparkiet pallid grijs turquoise",null,"02",3]
[19006015,"Kleurgrasparkiet pallid violet turquoise",null,"02",3]
[19006016,"Kleurgrasparkiet pallid geelmasker",null,"02",3]
[19006017,"Kleurgrasparkiet pallid D Geelmasker",null,"02",3]
[19006018,"Kleurgrasparkiet pallid DD geelmasker",null,"02",3]
[19006019,"Kleurgrasparkiet pallid grijs geelmasker",null,"02",3]
[19006020,"Kleurgrasparkiet pallid violet geelmasker",null,"02",3]
[19006021,"Kleurgrasparkiet pallid blauw",null,"02",3]
[19006022,"Kleurgrasparkiet pallid D blauw",null,"02",3]
[19006023,"Kleurgrasparkiet pallid DD blauw",null,"02",3]
[19006024,"Kleurgrasparkiet pallid grijsblauw",null,"02",3]
[19006025,"Kleurgrasparkiet pallid violetblauw",null,"02",3]
[19007001,"Kleurgrasparkiet SL ino groen",null,"02",3]
[19007002,"Kleurgrasparkiet SL ino aqua",null,"02",3]
[19007003,"Kleurgrasparkiet SL ino turquoise",null,"02",3]
[19007004,"Kleurgrasparkiet SL ino geelmasker",null,"02",3]
[19007005,"Kleurgrasparkiet SL ino blauw",null,"02",3]
[19008001,"Kleurgrasparkiet cinnamon-ino groen",null,"02",3]
[19008002,"Kleurgrasparkiet cinnamon-ino aqua",null,"02",3]
[19008003,"Kleurgrasparkiet cinnamon-ino turquoise",null,"02",3]
[19008004,"Kleurgrasparkiet cinnamon-ino geelmasker",null,"02",3]
[19008005,"Kleurgrasparkiet cinnamon-ino blauw",null,"02",3]
[19008006,"Kleurgrasparkiet opaline-cinnamon-ino groen",null,"02",3]
[19008007,"Kleurgrasparkiet opaline-cinnamon-ino aqua",null,"02",3]
[19008008,"Kleurgrasparkiet opaline-cinnamon-ino turquoise",null,"02",3]
[19008009,"Kleurgrasparkiet opaline-cinnamon-ino geelmasker",null,"02",3]
[19008010,"Kleurgrasparkiet opaline-cinnamon-ino blauw",null,"02",3]
[19009001,"Kleurgrasparkiet EF spangle groen",null,"02",3]
[19009002,"Kleurgrasparkiet EF spangle D groen",null,"02",3]
[19009003,"Kleurgrasparkiet EF spangle DD groen",null,"02",3]
[19009004,"Kleurgrasparkiet EF spangle grijsgroen",null,"02",3]
[19009005,"Kleurgrasparkiet EF spangle violet groen",null,"02",3]
[19009006,"Kleurgrasparkiet EF spangle aqua",null,"02",3]
[19009007,"Kleurgrasparkiet EF spangle D aqua",null,"02",3]
[19009008,"Kleurgrasparkiet EF spangle DD aqua",null,"02",3]
[19009009,"Kleurgrasparkiet EF spangle grijs aqua",null,"02",3]
[19009010,"Kleurgrasparkiet EF spangle violet aqua",null,"02",3]
[19009011,"Kleurgrasparkiet EF spangle turquoise",null,"02",3]
[19009012,"Kleurgrasparkiet EF spangle D turquoise",null,"02",3]
[19009013,"Kleurgrasparkiet EF spangle DD turquoise",null,"02",3]
[19009014,"Kleurgrasparkiet EF spangle grijs turquoise",null,"02",3]
[19009015,"Kleurgrasparkiet EF spangle violet turquoise",null,"02",3]
[19009016,"Kleurgrasparkiet EF spangle geelmasker",null,"02",3]
[19009017,"Kleurgrasparkiet EF spangle D geelmasker",null,"02",3]
[19009018,"Kleurgrasparkiet EF spangle DD geelmasker",null,"02",3]
[19009019,"Kleurgrasparkiet EF spangle grijs geelmasker",null,"02",3]
[19009020,"Kleurgrasparkiet EF spangle violet geelmasker",null,"02",3]
[19009021,"Kleurgrasparkiet EF spangle Blauw",null,"02",3]
[19009022,"Kleurgrasparkiet EF spangle D blauw",null,"02",3]
[19009023,"Kleurgrasparkiet EF spangle DD blauw",null,"02",3]
[19009024,"Kleurgrasparkiet EF spangle grijsblauw",null,"02",3]
[19009025,"Kleurgrasparkiet EF spangle violetblauw",null,"02",3]
[19009026,"Kleurgrasparkiet EF spangle cinnamon groen",null,"02",3]
[19009027,"Kleurgrasparkiet EF spangle cinnamon D groen",null,"02",3]
[19009028,"Kleurgrasparkiet EF spangle cinnamon DD groen",null,"02",3]
[19009029,"Kleurgrasparkiet EF spangle cinnamon grijsgroen",null,"02",3]
[19009030,"Kleurgrasparkiet EF spangle cinnamon violet groen",null,"02",3]
[19009031,"Kleurgrasparkiet EF spangle cinnamon aqua",null,"02",3]
[19009032,"Kleurgrasparkiet EF spangle cinnamon D Aqua",null,"02",3]
[19009033,"Kleurgrasparkiet EF spangle cinnamon DD aqua",null,"02",3]
[19009034,"Kleurgrasparkiet EF spangle cinnamon grijs aqua",null,"02",3]
[19009035,"Kleurgrasparkiet EF spangle cinnamon violet aqua",null,"02",3]
[19009036,"Kleurgrasparkiet EF spangle cinnamon turquoise",null,"02",3]
[19009037,"Kleurgrasparkiet EF spangle cinnamon D turquoise",null,"02",3]
[19009038,"Kleurgrasparkiet EF spangle cinnamon DD turquoise",null,"02",3]
[19009039,"Kleurgrasparkiet EF spangle cinnamon grijs turquoise",null,"02",3]
[19009040,"Kleurgrasparkiet EF spangle cinnamon violet turquoise",null,"02",3]
[19009041,"Kleurgrasparkiet EF spangle cinnamon geelmasker",null,"02",3]
[19009042,"Kleurgrasparkiet EF spangle cinnamon D geelmasker",null,"02",3]
[19009043,"Kleurgrasparkiet EF spangle cinnamon DD geelmasker",null,"02",3]
[19009044,"Kleurgrasparkiet EF spangle cinnamon grijs geelmasker",null,"02",3]
[19009045,"Kleurgrasparkiet EF spangle cinnamon violet geelmasker",null,"02",3]
[19009046,"Kleurgrasparkiet EF spangle cinnamon blauw",null,"02",3]
[19009047,"Kleurgrasparkiet EF spangle cinnamon D blauw",null,"02",3]
[19009048,"Kleurgrasparkiet EF spangle cinnamon DD blauw",null,"02",3]
[19009049,"Kleurgrasparkiet EF spangle cinnamon grijsblauw",null,"02",3]
[19009050,"Kleurgrasparkiet EF spangle cinnamon violetblauw",null,"02",3]
[19009051,"Kleurgrasparkiet cleartail groenserie",null,"02",3]
[19009052,"Kleurgrasparkiet cleartail aquaserie",null,"02",3]
[19009053,"Kleurgrasparkiet cleartail turquoiseserie",null,"02",3]
[19009054,"Kleurgrasparkiet cleartail geelmaskerserie",null,"02",3]
[19009055,"Kleurgrasparkiet cleartail blauwserie",null,"02",3]
[19010001,"Kleurgrasparkiet grijsvleugel groen",null,"02",3]
[19010002,"Kleurgrasparkiet grijsvleugel D groen",null,"02",3]
[19010003,"Kleurgrasparkiet grijsvleugel DD groen",null,"02",3]
[19010004,"Kleurgrasparkiet grijsvleugel grijsgroen",null,"02",3]
[19010005,"Kleurgrasparkiet grijsvleugel violet groen",null,"02",3]
[19010006,"Kleurgrasparkiet grijsvleugel aqua",null,"02",3]
[19010007,"Kleurgrasparkiet grijsvleugel D Aqua",null,"02",3]
[19010008,"Kleurgrasparkiet grijsvleugel DD aqua",null,"02",3]
[19010009,"Kleurgrasparkiet grijsvleugel grijs aqua",null,"02",3]
[19010010,"Kleurgrasparkiet grijsvleugel violet aqua",null,"02",3]
[19010011,"Kleurgrasparkiet grijsvleugel turquoise",null,"02",3]
[19010012,"Kleurgrasparkiet grijsvleugel D turquoise",null,"02",3]
[19010013,"Kleurgrasparkiet grijsvleugel DD turquoise",null,"02",3]
[19010014,"Kleurgrasparkiet grijsvleugel grijs turquoise",null,"02",3]
[19010015,"Kleurgrasparkiet grijsvleugel violet turquoise",null,"02",3]
[19010016,"Kleurgrasparkiet grijsvleugel geelmasker",null,"02",3]
[19010017,"Kleurgrasparkiet grijsvleugel D geelmasker",null,"02",3]
[19010018,"Kleurgrasparkiet grijsvleugel DD geelmasker",null,"02",3]
[19010019,"Kleurgrasparkiet grijsvleugel grijs geelmasker",null,"02",3]
[19010020,"Kleurgrasparkiet grijsvleugel violet geelmasker",null,"02",3]
[19010021,"Kleurgrasparkiet grijsvleugel blauw",null,"02",3]
[19010022,"Kleurgrasparkiet grijsvleugel D blauw",null,"02",3]
[19010023,"Kleurgrasparkiet grijsvleugel DD blauw",null,"02",3]
[19010024,"Kleurgrasparkiet grijsvleugel grijsblauw",null,"02",3]
[19010025,"Kleurgrasparkiet grijsvleugel violetblauw",null,"02",3]
[19011001,"Kleurgrasparkiet blankvleugel groen",null,"02",3]
[19011002,"Kleurgrasparkiet blankvleugel D groen",null,"02",3]
[19011003,"Kleurgrasparkiet blankvleugel DD groen",null,"02",3]
[19011004,"Kleurgrasparkiet blankvleugel grijsgroen",null,"02",3]
[19011005,"Kleurgrasparkiet blankvleugel violet groen",null,"02",3]
[19011006,"Kleurgrasparkiet blankvleugel aqua",null,"02",3]
[19011007,"Kleurgrasparkiet blankvleugel D Aqua",null,"02",3]
[19011008,"Kleurgrasparkiet blankvleugel DD aqua",null,"02",3]
[19011009,"Kleurgrasparkiet blankvleugel grijs aqua",null,"02",3]
[19011010,"Kleurgrasparkiet blankvleugel violet aqua",null,"02",3]
[19011011,"Kleurgrasparkiet blankvleugel turquoise",null,"02",3]
[19011012,"Kleurgrasparkiet blankvleugel D turquoise",null,"02",3]
[19011013,"Kleurgrasparkiet blankvleugel DD turquoise",null,"02",3]
[19011014,"Kleurgrasparkiet blankvleugel grijs turquoise",null,"02",3]
[19011015,"Kleurgrasparkiet blankvleugel violet turquoise",null,"02",3]
[19011016,"Kleurgrasparkiet blankvleugel geelmasker",null,"02",3]
[19011017,"Kleurgrasparkiet blankvleugel D geelmasker",null,"02",3]
[19011018,"Kleurgrasparkiet blankvleugel DD geelmasker",null,"02",3]
[19011019,"Kleurgrasparkiet blankvleugel grijs geelmasker",null,"02",3]
[19011020,"Kleurgrasparkiet blankvleugel violet geelmasker",null,"02",3]
[19011021,"Kleurgrasparkiet blankvleugel blauw",null,"02",3]
[19011022,"Kleurgrasparkiet blankvleugel D blauw",null,"02",3]
[19011023,"Kleurgrasparkiet blankvleugel DD blauw",null,"02",3]
[19011024,"Kleurgrasparkiet blankvleugel grijsblauw",null,"02",3]
[19011025,"Kleurgrasparkiet blankvleugel violetblauw",null,"02",3]
[19012001,"Kleurgrasparkiet dilute groen",null,"02",3]
[19012002,"Kleurgrasparkiet dilute D groen",null,"02",3]
[19012003,"Kleurgrasparkiet dilute DD groen",null,"02",3]
[19012004,"Kleurgrasparkiet dilute grijsgroen",null,"02",3]
[19012005,"Kleurgrasparkiet dilute violet groen",null,"02",3]
[19012006,"Kleurgrasparkiet dilute aqua",null,"02",3]
[19012007,"Kleurgrasparkiet dilute D aqua",null,"02",3]
[19012008,"Kleurgrasparkiet dilute DD aqua",null,"02",3]
[19012009,"Kleurgrasparkiet dilute grijs aqua",null,"02",3]
[19012010,"Kleurgrasparkiet dilute violet aqua",null,"02",3]
[19012011,"Kleurgrasparkiet dilute turquoise",null,"02",3]
[19012012,"Kleurgrasparkiet dilute D turquoise",null,"02",3]
[19012013,"Kleurgrasparkiet dilute DD turquoise",null,"02",3]
[19012014,"Kleurgrasparkiet dilute grijs turquoise",null,"02",3]
[19012015,"Kleurgrasparkiet dilute violet turquoise",null,"02",3]
[19012016,"Kleurgrasparkiet dilute geelmasker",null,"02",3]
[19012017,"Kleurgrasparkiet dilute D geelmasker",null,"02",3]
[19012018,"Kleurgrasparkiet dilute DD geelmasker",null,"02",3]
[19012019,"Kleurgrasparkiet dilute grijs geelmasker",null,"02",3]
[19012020,"Kleurgrasparkiet dilute violet geelmasker",null,"02",3]
[19012021,"Kleurgrasparkiet dilute blauw",null,"02",3]
[19012022,"Kleurgrasparkiet dilute D blauw",null,"02",3]
[19012023,"Kleurgrasparkiet dilute DD blauw",null,"02",3]
[19012024,"Kleurgrasparkiet dilute grijsblauw",null,"02",3]
[19012025,"Kleurgrasparkiet dilute violetblauw",null,"02",3]
[19013001,"Kleurgrasparkiet bronze fallow groen",null,"02",3]
[19013002,"Kleurgrasparkiet bronze fallow D groen",null,"02",3]
[19013003,"Kleurgrasparkiet bronze fallow DD groen",null,"02",3]
[19013004,"Kleurgrasparkiet bronze fallow grjsgroen",null,"02",3]
[19013005,"Kleurgrasparkiet bronze fallow violet groen",null,"02",3]
[19013006,"Kleurgrasparkiet bronze fallow aqua",null,"02",3]
[19013007,"Kleurgrasparkiet bronze fallow D aqua",null,"02",3]
[19013008,"Kleurgrasparkiet bronze fallow DD aqua",null,"02",3]
[19013009,"Kleurgrasparkiet bronze fallow rec.grijs aqua",null,"02",3]
[19013010,"Kleurgrasparkiet bronze fallow violet aqua",null,"02",3]
[19013011,"Kleurgrasparkiet bronze fallow turquoise",null,"02",3]
[19013012,"Kleurgrasparkiet bronze fallow D turquoise",null,"02",3]
[19013013,"Kleurgrasparkiet bronze fallow DD turquoise",null,"02",3]
[19013014,"Kleurgrasparkiet bronze fallow rec.grijs turquoise",null,"02",3]
[19013015,"Kleurgrasparkiet bronze fallow violet turquoise",null,"02",3]
[19013016,"Kleurgrasparkiet bronze fallow geelmasker",null,"02",3]
[19013017,"Kleurgrasparkiet bronze fallow D geelmasker",null,"02",3]
[19013018,"Kleurgrasparkiet bronze fallow DD geelmasker",null,"02",3]
[19013019,"Kleurgrasparkiet bronze fallow rec.grijs geelmasker",null,"02",3]
[19013020,"Kleurgrasparkiet bronze fallow violet geelmasker",null,"02",3]
[19013021,"Kleurgrasparkiet bronze fallow blauw",null,"02",3]
[19013022,"Kleurgrasparkiet bronze fallow D blauw",null,"02",3]
[19013023,"Kleurgrasparkiet bronze fallow DD blauw",null,"02",3]
[19013024,"Kleurgrasparkiet bronze fallow rec.grijsblauw",null,"02",3]
[19013025,"Kleurgrasparkiet bronze fallow violetblauw",null,"02",3]
[19013026,"Kleurgrasparkiet pale fallow groen serie",null,"02",3]
[19013027,"Kleurgrasparkiet pale fallow aqua serie",null,"02",3]
[19013028,"Kleurgrasparkiet pale fallow turquoise serie",null,"02",3]
[19013029,"Kleurgrasparkiet pale fallow geelmasker serie",null,"02",3]
[19013030,"Kleurgrasparkiet pale fallow blauw serie",null,"02",3]
[19014001,"Kleurgrasparkiet dom. bont groen serie (incl. opaline en/of cinnamon)",null,"02",3]
[19014002,"Kleurgrasparkiet dom. bont aqua serie (incl. opaline en/of cinnamon)",null,"02",3]
[19014003,"Kleurgrasparkiet dom. bont turquoise serie (incl. opaline en/of cinnamon)",null,"02",3]
[19014004,"Kleurgrasparkiet dom. bont geelmasker serie (incl. opaline en/of cinnamon)",null,"02",3]
[19014005,"Kleurgrasparkiet dom. bont blauw serie (incl. opaline en/of cinnamon)",null,"02",3]
[19014006,"Kleurgrasparkiet dom. bont klaarpen groen serie (incl. opaline en/of cinnamon)",null,"02",3]
[19014007,"Kleurgrasparkiet dom. bont klaarpen aqua serie (incl. opaline en/of cinnamon)",null,"02",3]
[19014008,"Kleurgrasparkiet dom. bont klaarpen turquoise serie (incl. opal.e/o Cinn.)",null,"02",3]
[19014009,"Kleurgrasparkiet dom. bont klaarpen geelmasker serie (incl. opal.e/o Cinn.)",null,"02",3]
[19014010,"Kleurgrasparkiet dom. bont klaarpen blauw serie (incl. opaline en/of cinnamon)",null,"02",3]
[19014011,"Kleurgrasparkiet hollands  bont groen serie (incl. opaline en/of cinnamon)",null,"02",3]
[19014012,"Kleurgrasparkiet hollands bont aqua serie (incl. opaline en/of cinnamon)",null,"02",3]
[19014013,"Kleurgrasparkiet hollands bont turquoise serie (incl. opaline en/of cinnamon)",null,"02",3]
[19014014,"Kleurgrasparkiet hollands bont geelmasker serie (incl. opaline en/of cinnamon)",null,"02",3]
[19014015,"Kleurgrasparkiet hollands bont blauw serie (incl. opaline en/of cinnamon)",null,"02",3]
[19015001,"Kleurgrasparkiet rec.bont groen serie  (incl. opaline en/ of cinnamon)",null,"02",3]
[19015002,"Kleurgrasparkiet rec.bont aqua serie  (incl. opaline en/ of cinnamon)",null,"02",3]
[19015003,"Kleurgrasparkiet rec.bont turquoise serie  (incl. opaline en/ of cinnamon)",null,"02",3]
[19015004,"Kleurgrasparkiet rec.bont geelmasker serie  (incl. opaline en/ of cinnamon)",null,"02",3]
[19015005,"Kleurgrasparkiet rec.bont blauw serie  (incl. opaline en/ of cinnamon)",null,"02",3]
[19016001,"Kleurgrasparkiet opaline groen",null,"02",3]
[19016002,"Kleurgrasparkiet opaline D groen",null,"02",3]
[19016003,"Kleurgrasparkiet opaline DD groen",null,"02",3]
[19016004,"Kleurgrasparkiet opaline grijsgroen",null,"02",3]
[19016005,"Kleurgrasparkiet opaline violet groen",null,"02",3]
[19017001,"Kleurgrasparkiet opaline aqua",null,"02",3]
[19017002,"Kleurgrasparkiet opaline D aqua",null,"02",3]
[19017003,"Kleurgrasparkiet opaline DD aqua",null,"02",3]
[19017004,"Kleurgrasparkiet opaline grijs aqua",null,"02",3]
[19017005,"Kleurgrasparkiet opaline violet aqua",null,"02",3]
[19017006,"Kleurgrasparkiet opaline turquoise",null,"02",3]
[19017007,"Kleurgrasparkiet opaline D turquoise",null,"02",3]
[19017008,"Kleurgrasparkiet opaline DD turquoise",null,"02",3]
[19017009,"Kleurgrasparkiet opaline grijs turquoise",null,"02",3]
[19017010,"Kleurgrasparkiet opaline violet turquoise",null,"02",3]
[19017011,"Kleurgrasparkiet opaline geelmasker",null,"02",3]
[19017012,"Kleurgrasparkiet opaline D geelmasker",null,"02",3]
[19017013,"Kleurgrasparkiet opaline DD geelmasker",null,"02",3]
[19017014,"Kleurgrasparkiet opaline griis geelmasker",null,"02",3]
[19017015,"Kleurgrasparkiet opaline violet geelmasker",null,"02",3]
[19018001,"Kleurgrasparkiet opaline blauw",null,"02",3]
[19018002,"Kleurgrasparkiet opaline D blauw",null,"02",3]
[19018003,"Kleurgrasparkiet opaline DD blauw",null,"02",3]
[19018004,"Kleurgrasparkiet opaline grijsblauw",null,"02",3]
[19018005,"Kleurgrasparkiet opaline violetblauw",null,"02",3]
[19019001,"Kleurgrasparkiet opaline-cinnamon groen",null,"02",3]
[19019002,"Kleurgrasparkiet opaline-cinnamon D groen",null,"02",3]
[19019003,"Kleurgrasparkiet opaline-cinnamon DD groen",null,"02",3]
[19019004,"Kleurgrasparkiet opaline-cinnamon grijsgroen",null,"02",3]
[19019005,"Kleurgrasparkiet opaline-cinnamon violet groen",null,"02",3]
[19019006,"Kleurgrasparkiet opaline-cinnamon aqua",null,"02",3]
[19019007,"Kleurgrasparkiet opaline-cinnamon D Aqua",null,"02",3]
[19019008,"Kleurgrasparkiet opaline-cinnamon DD aqua",null,"02",3]
[19019009,"Kleurgrasparkiet opaline-cinnamon grijs aqua",null,"02",3]
[19019010,"Kleurgrasparkiet opaline-cinnamon violet aqua",null,"02",3]
[19019011,"Kleurgrasparkiet opaline-cinnamon turquoise",null,"02",3]
[19019012,"Kleurgrasparkiet opaline-cinnamon D turquoise",null,"02",3]
[19019013,"Kleurgrasparkiet opaline-cinnamon DD turquoise",null,"02",3]
[19019014,"Kleurgrasparkiet opaline-cinnamon grijs turquoise",null,"02",3]
[19019015,"Kleurgrasparkiet opaline-cinnamon violet turquoise",null,"02",3]
[19019016,"Kleurgrasparkiet opaline-cinnamon geelmasker",null,"02",3]
[19019017,"Kleurgrasparkiet opaline-cinnamon D Geelmasker",null,"02",3]
[19019018,"Kleurgrasparkiet opaline-cinnamon DD geelmasker",null,"02",3]
[19019019,"Kleurgrasparkiet opaline-cinnamon grijs geelmasker",null,"02",3]
[19019020,"Kleurgrasparkiet opaline-cinnamon violet geelmasker",null,"02",3]
[19019021,"Kleurgrasparkiet opaline-cinnamon blauw",null,"02",3]
[19019022,"Kleurgrasparkiet opaline-cinnamon D blauw",null,"02",3]
[19019023,"Kleurgrasparkiet opaline-cinnamon DD blauw",null,"02",3]
[19019024,"Kleurgrasparkiet opaline-cinnamon grijsblauw",null,"02",3]
[19019025,"Kleurgrasparkiet opaline-cinnamon violetblauw",null,"02",3]
[19020001,"Kleurgrasparkiet opaline-pallid groen",null,"02",3]
[19020002,"Kleurgrasparkiet opaline-pallid D groen",null,"02",3]
[19020003,"Kleurgrasparkiet opaline-pallid DD groen",null,"02",3]
[19020004,"Kleurgrasparkiet opaline-pallid grijsgroen",null,"02",3]
[19020005,"Kleurgrasparkiet opaline-pallid violet groen",null,"02",3]
[19020006,"Kleurgrasparkiet opaline-pallid aqua",null,"02",3]
[19020007,"Kleurgrasparkiet opaline-pallid D aqua",null,"02",3]
[19020008,"Kleurgrasparkiet opaline-pallid DD aqua",null,"02",3]
[19020009,"Kleurgrasparkiet opaline-pallid grijs aqua",null,"02",3]
[19020010,"Kleurgrasparkiet opaline-pallid violet aqua",null,"02",3]
[19020011,"Kleurgrasparkiet opaline-pallid turquoise",null,"02",3]
[19020012,"Kleurgrasparkiet opaline-pallid D turquoise",null,"02",3]
[19020013,"Kleurgrasparkiet opaline-pallid DD turquoise",null,"02",3]
[19020014,"Kleurgrasparkiet opaline-pallid grijs turquoise",null,"02",3]
[19020015,"Kleurgrasparkiet opaline-pallid violet turquoise",null,"02",3]
[19020016,"Kleurgrasparkiet opaline-pallid geelmasker",null,"02",3]
[19020017,"Kleurgrasparkiet opaline-pallid D Geelmasker",null,"02",3]
[19020018,"Kleurgrasparkiet opaline-pallid DD geelmasker",null,"02",3]
[19020019,"Kleurgrasparkiet opaline-pallid grijs geelmasker",null,"02",3]
[19020020,"Kleurgrasparkiet opaline-pallid violet geelmasker",null,"02",3]
[19020021,"Kleurgrasparkiet opaline-pallid blauw",null,"02",3]
[19020022,"Kleurgrasparkiet opaline-pallid D blauw",null,"02",3]
[19020023,"Kleurgrasparkiet opaline-pallid DD blauw",null,"02",3]
[19020024,"Kleurgrasparkiet opaline-pallid grijsblauw",null,"02",3]
[19020025,"Kleurgrasparkiet opaline-pallid violetblauw",null,"02",3]
[19021001,"Kleurgrasparkiet opaline grijsvleugel groen serie",null,"02",3]
[19021002,"Kleurgrasparkiet opaline grijsvleugel aqua serie",null,"02",3]
[19021003,"Kleurgrasparkiet opaline grijsvleugel turquoise serie",null,"02",3]
[19021004,"Kleurgrasparkiet opaline grijsvleugel geelmasker serie",null,"02",3]
[19021005,"Kleurgrasparkiet opaline grijsvleugel blauw serie",null,"02",3]
[19021006,"Kleurgrasparkiet opaline blankvleugel groen serie",null,"02",3]
[19021007,"Kleurgrasparkiet opaline blankvleugel aqua serie",null,"02",3]
[19021008,"Kleurgrasparkiet opaline blankvleugel turquoise serie",null,"02",3]
[19021009,"Kleurgrasparkiet opaline blankvleugel geelmasker serie",null,"02",3]
[19021010,"Kleurgrasparkiet opaline blankvleugel blauw serie",null,"02",3]
[19021011,"Kleurgrasparkiet opaline dilute groen serie",null,"02",3]
[19021012,"Kleurgrasparkiet opaline dilute aqua serie",null,"02",3]
[19021013,"Kleurgrasparkiet opaline dilute turquoise serie",null,"02",3]
[19021014,"Kleurgrasparkiet opaline dilute geelmasker serie",null,"02",3]
[19021015,"Kleurgrasparkiet opaline dilute blauw serie",null,"02",3]
[19022001,"Kleurgrasparkiet opaline bronze fallow groen serie",null,"02",3]
[19022002,"Kleurgrasparkiet opaline bronze fallow aqua serie",null,"02",3]
[19022003,"Kleurgrasparkiet opaline bronze fallow turquoise serie",null,"02",3]
[19022004,"Kleurgrasparkiet opaline bronze fallow geelmasker serie",null,"02",3]
[19022005,"Kleurgrasparkiet opaline bronze fallow blauw serie",null,"02",3]
[19022006,"Kleurgrasparkiet opaline pale fallow groen serie",null,"02",3]
[19022007,"Kleurgrasparkiet opaline pale fallow aqua serie",null,"02",3]
[19022008,"Kleurgrasparkiet opaline pale fallow turquoise serie",null,"02",3]
[19022009,"Kleurgrasparkiet opaline pale fallow geelmasker serie",null,"02",3]
[19022010,"Kleurgrasparkiet opaline pale fallow blauw serie",null,"02",3]
[19022011,"Kleurgrasparkiet opaline EF spangle groen serie",null,"02",3]
[19022012,"Kleurgrasparkiet opaline EF spangle aqua serie",null,"02",3]
[19022013,"Kleurgrasparkiet opaline EF spangle turquoise serie",null,"02",3]
[19022014,"Kleurgrasparkiet opaline EF spangle geelmasker serie",null,"02",3]
[19022015,"Kleurgrasparkiet opaline EF spangle blauw serie",null,"02",3]
[19023001,"Kleurgrasparkiet DF spangle groen",null,"02",3]
[19023002,"Kleurgrasparkiet DF spangle aqua",null,"02",3]
[19023003,"Kleurgrasparkiet DF spangle turquoise",null,"02",3]
[19023004,"Kleurgrasparkiet DF spangle geelmasker",null,"02",3]
[19023005,"Kleurgrasparkiet DF spangle blauw",null,"02",3]
[19023006,"Kleurgrasparkiet DEC groen",null,"02",3]
[19023007,"Kleurgrasparkiet DEC aqua",null,"02",3]
[19023008,"Kleurgrasparkiet DEC turquoise",null,"02",3]
[19023009,"Kleurgrasparkiet DEC geelmasker",null,"02",3]
[19023010,"Kleurgrasparkiet DEC blauw",null,"02",3]
[19024001,"Kleurgrasparkiet alle puntkuiven",null,"02",3]
[19024002,"Kleurgrasparkiet alle halve rozet kuiven",null,"02",3]
[19024003,"Kleurgrasparkiet alle rozet kuiven",null,"02",3]
[19025001,"Kleurgrasparkiet easley clearbody groen serie (incl. opaline)",null,"02",3]
[19025002,"Kleurgrasparkiet easley clearbody aqua serie (incl. opaline)",null,"02",3]
[19025003,"Kleurgrasparkiet easley clearbody turquoise serie (incl. opaline)",null,"02",3]
[19025004,"Kleurgrasparkiet easley clearbody geelmasker serie (incl. opaline)",null,"02",3]
[19025005,"Kleurgrasparkiet easley clearbody blauw serie (incl. opaline)",null,"02",3]
[19025006,"Kleurgrasparkiet easley clearbody blauw serie (incl. opaline)",null,"02",3]
[19025007,"Kleurgrasparkiet easley clearbody violetblauw serie (incl. opaline)",null,"02",3]
[19025008,"Kleurgrasparkiet easley clearbody grijsgroen serie (incl. opaline)",null,"02",3]
[19025009,"Kleurgrasparkiet easley  clearbody grijs geelmasker serie (incl. opaline)",null,"02",3]
[19026900,"Kleurgrasparkiet niet genoemde kleurslagen saddleback serie (incl. opaline)",null,"02",3]
[19027001,"Kleurgrasparkiet blackwing groen serie (incl. opaline)",null,"02",3]
[19027002,"Kleurgrasparkiet blackwing aqua serie (incl. opaline)",null,"02",3]
[19027003,"Kleurgrasparkiet blackwing turquoise serie (incl. opaline)",null,"02",3]
[19027004,"Kleurgrasparkiet blackwing geelmasker serie (incl. opaline)",null,"02",3]
[19027005,"Kleurgrasparkiet blackwing blauw serie (incl. opaline)",null,"02",3]
[19028001,"Kleurgrasparkiet blackface groen serie (incl. opaline)",null,"02",3]
[19028002,"Kleurgrasparkiet blackface aqua serie (incl. opaline)",null,"02",3]
[19028003,"Kleurgrasparkiet blackface turquoise serie (incl. opaline)",null,"02",3]
[19028004,"Kleurgrasparkiet blackface geelmasker serie (incl. opaline)",null,"02",3]
[19028005,"Kleurgrasparkiet blackface blauw serie (incl. opaline)",null,"02",3]
[19028050,"Kleurgrasparkiet blackface violetblauw (incl.opaline)",null,"02",3]
[19028051,"Kleurgrasparkiet blackface grijsgroen (incl.opaline)",null,"02",3]
[19028052,"Kleurgrasparkiet blackface grijsblauw (incl.opaline)",null,"02",3]
[19029001,"Kleurgrasparkiet antraciet blauw serie (incl. opaline en / of cinnamon)",null,"02",3]
[19029002,"Kleurgrasparkiet slate blauw (incl. opaline en / of cinnamon)",null,"02",3]
[19029003,"Kleurgrasparkiet slate violetblauw (incl. opaline en / of cinnamon)",null,"02",3]
[19190900,"Kleurgrasparkiet nieuwe nog niet erkende mut. en comb. m/p",null,"02",3]
[19190999,"Kleurgrasparkiet nieuwe mut. en comb. m/p (in standaard)",null,"02",3]
[20001001,"Grijsrugdwergpapegaai groen man",null,"02",3]
[20001002,"Grijsrugdwergpapegaai groen pop",null,"02",3]
[20002001,"Grijsrugdwergpapegaai D groen man",null,"02",3]
[20002002,"Grijsrugdwergpapegaai D groen pop",null,"02",3]
[20002003,"Grijsrugdwergpapegaai DD groen man",null,"02",3]
[20002004,"Grijsrugdwergpapegaai DD groen pop",null,"02",3]
[20003001,"Grijsrugdwergpapegaai turquoise man",null,"02",3]
[20003002,"Grijsrugdwergpapegaai turquoise pop",null,"02",3]
[20004001,"Grijsrugdwergpapegaai blauw man",null,"02",3]
[20004002,"Grijsrugdwergpapegaai blauw pop",null,"02",3]
[20004003,"Grijsrugdwergpapegaai D blauw man",null,"02",3]
[20004004,"Grijsrugdwergpapegaai D blauw pop",null,"02",3]
[20004005,"Grijsrugdwergpapegaai DD blauw man",null,"02",3]
[20004006,"Grijsrugdwergpapegaai DD blauw pop",null,"02",3]
[20005001,"Grijsrugdwergpapegaai rec.grijsgroen man",null,"02",3]
[20005002,"Grijsrugdwergpapegaai rec.grijsgroen pop",null,"02",3]
[20005003,"Grijsrugdwergpapegaai rec.grijs man",null,"02",3]
[20005004,"Grijsrugdwergpapegaai rec.grijs pop",null,"02",3]
[20005005,"Grijsrugdwergpapegaai rec.D grijs man",null,"02",3]
[20005006,"Grijsrugdwergpapegaai rec.D grijs pop",null,"02",3]
[20005007,"Grijsrugdwergpapegaai rec.DD grijs man",null,"02",3]
[20005008,"Grijsrugdwergpapegaai rec.DD grijs pop",null,"02",3]
[20006001,"Grijsrugdwergpapegaai cinnamon groen man",null,"02",3]
[20006002,"Grijsrugdwergpapegaai cinnamon groen pop",null,"02",3]
[20006003,"Grijsrugdwergpapegaai cinnamon D groen man",null,"02",3]
[20006004,"Grijsrugdwergpapegaai cinnamon D groen pop",null,"02",3]
[20006005,"Grijsrugdwergpapegaai cinnamon DD groen man",null,"02",3]
[20006006,"Grijsrugdwergpapegaai cinnamon DD groen pop",null,"02",3]
[20007001,"Grijsrugdwergpapegaai yellam groen man",null,"02",3]
[20007002,"Grijsrugdwergpapegaai yellam groen  pop",null,"02",3]
[20007013,"Grijsrugdwergpapegaai yellam blauw man",null,"02",3]
[20007014,"Grijsrugdwergpapegaai yellam blauw pop",null,"02",3]
[20008001,"Grijsrugdwergpapegaai marbled groen man",null,"02",3]
[20008002,"Grijsrugdwergpapegaai marbled groen pop",null,"02",3]
[20008003,"Grijsrugdwergpapegaai marbled D groen man",null,"02",3]
[20008004,"Grijsrugdwergpapegaai marbled D groen pop",null,"02",3]
[20008005,"Grijsrugdwergpapegaai marbled DD groen man",null,"02",3]
[20008006,"Grijsrugdwergpapegaai marbled DD groen pop",null,"02",3]
[20009001,"Grijsrugdwergpapegaai dun fallow groen man",null,"02",3]
[20009002,"Grijsrugdwergpapegaai dun fallow groen pop",null,"02",3]
[20009003,"Grijsrugdwergpapegaai dun fallow D groen man",null,"02",3]
[20009004,"Grijsrugdwergpapegaai dun fallow D groen pop",null,"02",3]
[20009005,"Grijsrugdwergpapegaai dun fallow DD groen man",null,"02",3]
[20009006,"Grijsrugdwergpapegaai dun fallow DD groen pop",null,"02",3]
[20009013,"Grijsrugdwergpapegaai dun fallow blauw man",null,"02",3]
[20009014,"Grijsrugdwergpapegaai dun fallow blauw pop",null,"02",3]
[20009015,"Grijsrugdwergpapegaai dun fallow D blauw man",null,"02",3]
[20009016,"Grijsrugdwergpapegaai dun fallow D blauw pop",null,"02",3]
[20009017,"Grijsrugdwergpapegaai dun fallow DD blauw man",null,"02",3]
[20009018,"Grijsrugdwergpapegaai dun fallow DD blauw pop",null,"02",3]
[20010001,"Grijsrugdwergpapegaai DF misty groen man",null,"02",3]
[20010002,"Grijsrugdwergpapegaai DF misty groen pop",null,"02",3]
[20010005,"Grijsrugdwergpapegaai DF misty blauw man",null,"02",3]
[20010006,"Grijsrugdwergpapegaai DF misty blauw pop",null,"02",3]
[20011001,"Grijsrugdwergpapegaai faded groen man",null,"02",3]
[20011002,"Grijsrugdwergpapegaai faded groen pop",null,"02",3]
[20011003,"Grijsrugdwergpapegaai faded D groen man",null,"02",3]
[20011004,"Grijsrugdwergpapegaai faded D groen pop",null,"02",3]
[20011005,"Grijsrugdwergpapegaai faded DD groen man",null,"02",3]
[20011006,"Grijsrugdwergpapegaai faded DD groen pop",null,"02",3]
[20011019,"Grijsrugdwergpapegaai faded blauw man",null,"02",3]
[20011020,"Grijsrugdwergpapegaai faded blauw pop",null,"02",3]
[20011021,"Grijsrugdwergpapegaai faded D blauw man",null,"02",3]
[20011022,"Grijsrugdwergpapegaai faded D blauw pop",null,"02",3]
[20011023,"Grijsrugdwergpapegaai faded DD blauw man",null,"02",3]
[20011024,"Grijsrugdwergpapegaai faded DD blauw pop",null,"02",3]
[20012001,"Grijsrugdwergpapegaai NSL ino groen (lutino) man",null,"02",3]
[20012002,"Grijsrugdwergpapegaai NSL ino groen (lutino) pop",null,"02",3]
[20012005,"Grijsrugdwergpapegaai NSL ino blauw (albino) man pop",null,"02",3]
[20013001,"Grijsrugdwergpapegaai dominant bont groen serie man",null,"02",3]
[20013002,"Grijsrugdwergpapegaai dominant bont groen serie pop",null,"02",3]
[20013005,"Grijsrugdwergpapegaai dominant bont blauw serie man",null,"02",3]
[20013006,"Grijsrugdwergpapegaai dominant bont blauw serie pop",null,"02",3]
[20013007,"Grijsrugdwergpapegaai recessief bont groen serie man en pop",null,"02",3]
[20013009,"Grijsrugdwergpapegaai recessief bont blauw serie man en pop",null,"02",3]
[20014900,"Grijsrugdwergpapegaai nieuwe nog niet erkende mut. en comb. m/p",null,"02",3]
[20014999,"Grijsrugdwergpapegaai nieuwe mut. en comb. m/p (in standaard)",null,"02",3]
[20015001,"Groenstuitdwergpapegaai groen man",null,"02",3]
[20015002,"Groenstuitdwergpapegaai groen pop",null,"02",3]
[20016001,"Groenstuitdwergpapegaai DF misty groen man",null,"02",3]
[20016002,"Groenstuitdwergpapegaai DF misty groen pop",null,"02",3]
[20016900,"Groenstuitdwergpapegaai nieuwe nog niet erkende mut. en comb. m/p",null,"02",3]
[20016999,"Groenstuitdwergpapegaai nieuwe mut. en comb. m/p (in standaard)",null,"02",3]
[20017001,"Prachtdwergpapegaai groen man",null,"02",3]
[20017002,"Prachtdwergpapegaai groen pop",null,"02",3]
[20018900,"Prachtdwergpapegaai nieuwe nog niet erkende mut. en comb. m/p",null,"02",3]
[20018999,"Prachtdwergpapegaai nieuwe mut. en comb. m/p (in standaard)",null,"02",3]
[20019001,"Oogringdwergpapegaai groen man",null,"02",3]
[20019002,"Oogringdwergpapegaai groen pop",null,"02",3]
[20020001,"Oogringdwergpapegaai dominant bont man",null,"02",3]
[20020002,"Oogringdwergpapegaai dominant bont pop",null,"02",3]
[20021900,"Oogringdwergpapegaai nieuwe nog niet erkende mut. en comb. m/p",null,"02",3]
[20021999,"Oogringdwergpapegaai nieuwe mut. en comb. m/p (in standaard)",null,"02",3]
[20022001,"Mexicaanse dwergpapegaai groen man",null,"02",3]
[20022002,"Mexicaanse dwergpapegaai groen pop",null,"02",3]
[20022003,"Tres-mares blauwstuit dwergpapegaai groen man",null,"02",3]
[20022004,"Tres-mares blauwstuit dwergpapegaai groen pop",null,"02",3]
[20022005,"Blauwvleugel dwergpapegaai groen man",null,"02",3]
[20022006,"Blauwvleugel dwergpapegaai groen pop",null,"02",3]
[20022007,"Ceara blauwvleugeldwergpapegaai groen man",null,"02",3]
[20022008,"Ceara blauwvleugeldwergpapegaai groen pop",null,"02",3]
[20022009,"Salvadoris dwergpapegaai groen man",null,"02",3]
[20022010,"Salvadoris dwergpapegaai groen pop",null,"02",3]
[20022011,"Spengeli dwergpapegaai groen man",null,"02",3]
[20022012,"Spengeli dwergpapegaai groen pop",null,"02",3]
[20022013,"Geelmaskerdwergpapegaai groen man",null,"02",3]
[20022014,"Geelmaskerdwergpapegaai groen pop",null,"02",3]
[20190900,"Overige forpussen nieuwe nog niet erkende mut. en comb. m/p",null,"02",3]
[20190999,"Overige forpussen nieuwe mut. en comb. m/p (in standaard)",null,"02",3]
[21101001,"Agapornis roseicollis groen",null,"02",3]
[21102001,"Agapornis roseicollis D groen",null,"02",3]
[21102002,"Agapornis roseicollis DD groen",null,"02",3]
[21102003,"Agapornis roseicollis violet groen",null,"02",3]
[21103001,"Agapornis roseicollis aqua",null,"02",3]
[21103002,"Agapornis roseicollis D aqua",null,"02",3]
[21103003,"Agapornis roseicollis DD aqua",null,"02",3]
[21103004,"Agapornis roseicollis violet aqua",null,"02",3]
[21103005,"Agapornis roseicollis turquoise",null,"02",3]
[21103006,"Agapornis roseicollis D turquoise",null,"02",3]
[21103007,"Agapornis roseicollis DD turquoise",null,"02",3]
[21103008,"Agapornis roseicollis violet turquoise",null,"02",3]
[21104001,"Agapornis roseicollis blauw",null,"02",3]
[21104002,"Agapornis roseicollis D blauw",null,"02",3]
[21104003,"Agapornis roseicollis DD blauw",null,"02",3]
[21104004,"Agapornis roseicollis violetblauw",null,"02",3]
[21105001,"Agapornis roseicollis cinnamon groen",null,"02",3]
[21105002,"Agapornis roseicollis cinnamon D groen",null,"02",3]
[21105003,"Agapornis roseicollis cinnamon DD groen",null,"02",3]
[21105004,"Agapornis roseicollis cinnamon violet groen",null,"02",3]
[21105005,"Agapornis roseicollis cinnamon aqua",null,"02",3]
[21105006,"Agapornis roseicollis cinnamon D aqua",null,"02",3]
[21105007,"Agapornis roseicollis cinnamon DD aqua",null,"02",3]
[21105008,"Agapornis roseicollis cinnamon violet  aqua",null,"02",3]
[21105009,"Agapornis roseicollis cinnamon turquoise",null,"02",3]
[21105010,"Agapornis roseicollis cinnamon D turquoise",null,"02",3]
[21105011,"Agapornis roseicollis cinnamon DD turquoise",null,"02",3]
[21105012,"Agapornis roseicollis cinnamon violet turquoise",null,"02",3]
[21105013,"Agapornis roseicollis cinnamon blauw",null,"02",3]
[21105014,"Agapornis roseicollis cinnamon D blauw",null,"02",3]
[21105015,"Agapornis roseicollis cinnamon DD blauw",null,"02",3]
[21105016,"Agapornis roseicollis cinnamon violetblauw",null,"02",3]
[21105017,"Agapornis roseicollis cinnamon-ino groen",null,"02",3]
[21105018,"Agapornis roseicollis cinnamon-ino aqua",null,"02",3]
[21105019,"Agapornis roseicollis cinnamon-ino turquoise",null,"02",3]
[21105020,"Agapornis roseicollis cinnamon-ino blauw",null,"02",3]
[21105021,"Agapornis roseicollis cinnamon-ino oranjemasker groen",null,"02",3]
[21105022,"Agapornis roseicollis cinnamon-ino pale headed groen (incl.alle mut.)",null,"02",3]
[21105023,"Agapornis roseicollis cinnamon oranjemasker groen",null,"02",3]
[21105024,"Agapornis roseicollis cinnamon oranjemasker D groen",null,"02",3]
[21105025,"Agapornis roseicollis cinnamon oranjemasker DD groen",null,"02",3]
[21105026,"Agapornis roseicollis cinnamon oranjemasker violet groen",null,"02",3]
[21105027,"Agapornis roseicollis cinnamon pale headed groen (incl.alle mut.)",null,"02",3]
[21106001,"Agapornis roseicollis pallid groen",null,"02",3]
[21106002,"Agapornis roseicollis pallid D groen",null,"02",3]
[21106003,"Agapornis roseicollis pallid DD groen",null,"02",3]
[21106004,"Agapornis roseicollis pallid violet groen",null,"02",3]
[21106005,"Agapornis roseicollis pallid aqua",null,"02",3]
[21106006,"Agapornis roseicollis pallid D aqua",null,"02",3]
[21106007,"Agapornis roseicollis pallid DD aqua",null,"02",3]
[21106008,"Agapornis roseicollis pallid violet aqua",null,"02",3]
[21106009,"Agapornis roseicollis pallid turquoise",null,"02",3]
[21106010,"Agapornis roseicollis pallid D turquoise",null,"02",3]
[21106011,"Agapornis roseicollis pallid DD turquoise",null,"02",3]
[21106012,"Agapornis roseicollis pallid violet turquoise",null,"02",3]
[21106013,"Agapornis roseicollis pallid blauw",null,"02",3]
[21106014,"Agapornis roseicollis pallid D blauw",null,"02",3]
[21106015,"Agapornis roseicollis pallid DD blauw",null,"02",3]
[21106016,"Agapornis roseicollis pallid violetblauw",null,"02",3]
[21106017,"Agapornis roseicollis pallid oranjemasker groen",null,"02",3]
[21106018,"Agapornis roseicollis pallid oranjemasker D groen",null,"02",3]
[21106019,"Agapornis roseicollis pallid oranjemasker DD groen",null,"02",3]
[21106020,"Agapornis roseicollis pallid oranjemasker violet groen",null,"02",3]
[21106021,"Agapornis roseicollis pallid pale headed groen (incl.alle mut.)",null,"02",3]
[21107001,"Agapornis roseicollis SL ino groen",null,"02",3]
[21107002,"Agapornis roseicollis SL ino aqua",null,"02",3]
[21107003,"Agapornis roseicollis SL ino turquoise",null,"02",3]
[21107004,"Agapornis roseicollis SL ino blauw",null,"02",3]
[21107005,"Agapornis roseicollis SL ino oranjemasker groen",null,"02",3]
[21107006,"Agapornis roseicollis SL ino pale headed groen (incl.alle mut.)",null,"02",3]
[21108001,"Agapornis roseicollis dilute groen",null,"02",3]
[21108002,"Agapornis roseicollis dilute D groen",null,"02",3]
[21108003,"Agapornis roseicollis dilute DD groen",null,"02",3]
[21108004,"Agapornis roseicollis dilute violet groen",null,"02",3]
[21108005,"Agapornis roseicollis dilute aqua",null,"02",3]
[21108006,"Agapornis roseicollis dilute D aqua",null,"02",3]
[21108007,"Agapornis roseicollis dilute DD aqua",null,"02",3]
[21108008,"Agapornis roseicollis dilute violet aqua",null,"02",3]
[21108009,"Agapornis roseicollis dilute turquoise",null,"02",3]
[21108010,"Agapornis roseicollis dilute D turquoise",null,"02",3]
[21108011,"Agapornis roseicollis dilute DD turquoise",null,"02",3]
[21108012,"Agapornis roseicollis dilute violet turquoise",null,"02",3]
[21108013,"Agapornis roseicollis dilute blauw",null,"02",3]
[21108014,"Agapornis roseicollis dilute D blauw",null,"02",3]
[21108015,"Agapornis roseicollis dilute DD blauw",null,"02",3]
[21108016,"Agapornis roseicollis dilute violetblauw",null,"02",3]
[21108017,"Agapornis roseicollis dilute oranjemasker groen",null,"02",3]
[21108018,"Agapornis roseicollis dilute oranjemasker D groen",null,"02",3]
[21108019,"Agapornis roseicollis dilute oranjemasker DD groen",null,"02",3]
[21108020,"Agapornis roseicollis dilute oranjemasker violet groen",null,"02",3]
[21108021,"Agapornis roseicollis dilute pale headed groen (incl.alle mut.)",null,"02",3]
[21109001,"Agapornis roseicollis marbled groen",null,"02",3]
[21109002,"Agapornis roseicollis marbled D groen",null,"02",3]
[21109003,"Agapornis roseicollis marbled DD groen",null,"02",3]
[21109004,"Agapornis roseicollis marbled violet groen",null,"02",3]
[21109005,"Agapornis roseicollis marbled aqua",null,"02",3]
[21109006,"Agapornis roseicollis marbled D aqua",null,"02",3]
[21109007,"Agapornis roseicollis marbled DD aqua",null,"02",3]
[21109008,"Agapornis roseicollis marbled violet aqua",null,"02",3]
[21109009,"Agapornis roseicollis marbled turquoise",null,"02",3]
[21109010,"Agapornis roseicollis marbled D turquoise",null,"02",3]
[21109011,"Agapornis roseicollis marbled DD turquoise",null,"02",3]
[21109012,"Agapornis roseicollis marbled violet turquoise",null,"02",3]
[21109013,"Agapornis roseicollis marbled blauw",null,"02",3]
[21109014,"Agapornis roseicollis marbled D blauw",null,"02",3]
[21109015,"Agapornis roseicollis marbled DD blauw",null,"02",3]
[21109016,"Agapornis roseicollis marbled violetblauw",null,"02",3]
[21109017,"Agapornis roseicollis marbled oranjemasker  groen",null,"02",3]
[21109018,"Agapornis roseicollis marbled oranjemasker D groen",null,"02",3]
[21109019,"Agapornis roseicollis marbled oranjemasker DD groen",null,"02",3]
[21109020,"Agapornis roseicollis marbled oranjemasker violet groen",null,"02",3]
[21109021,"Agapornis roseicollis marbled pale headed groen (incl.alle mut.)",null,"02",3]
[21111001,"Agapornis roseicollis bronze fallow groen",null,"02",3]
[21111002,"Agapornis roseicollis bronze fallow D groen",null,"02",3]
[21111003,"Agapornis roseicollis bronze fallow DD groen",null,"02",3]
[21111004,"Agapornis roseicollis bronze fallow violet groen",null,"02",3]
[21111005,"Agapornis roseicollis bronze fallow aqua",null,"02",3]
[21111006,"Agapornis roseicollis bronze fallow D aqua",null,"02",3]
[21111007,"Agapornis roseicollis bronze fallow DD aqua",null,"02",3]
[21111008,"Agapornis roseicollis bronze fallow violet aqua",null,"02",3]
[21111009,"Agapornis roseicollis bronze fallow turquoise",null,"02",3]
[21111010,"Agapornis roseicollis bronze fallow D turquoise",null,"02",3]
[21111011,"Agapornis roseicollis bronze fallow DD turquoise",null,"02",3]
[21111012,"Agapornis roseicollis bronze fallow violet turquoise",null,"02",3]
[21111013,"Agapornis roseicollis bronze fallow blauw",null,"02",3]
[21111014,"Agapornis roseicollis bronze fallow D blauw",null,"02",3]
[21111015,"Agapornis roseicollis bronze fallow DD blauw",null,"02",3]
[21111016,"Agapornis roseicollis bronze fallow violetblauw",null,"02",3]
[21111017,"Agapornis roseicollis bronze fallow oranjemasker groen",null,"02",3]
[21111018,"Agapornis roseicollis bronze fallow oranjemasker D groen",null,"02",3]
[21111019,"Agapornis roseicollis bronze fallow oranjemasker DD groen",null,"02",3]
[21111020,"Agapornis roseicollis bronze fallow oranjemasker violet groen",null,"02",3]
[21111021,"Agapornis roseicollis bronze fallow pale headed groen (incl.alle mut.)",null,"02",3]
[21112001,"Agapornis roseicollis pale fallow groen",null,"02",3]
[21112002,"Agapornis roseicollis pale fallow D groen",null,"02",3]
[21112003,"Agapornis roseicollis pale fallow DD groen",null,"02",3]
[21112004,"Agapornis roseicollis pale fallow violet groen",null,"02",3]
[21112005,"Agapornis roseicollis pale fallow aqua",null,"02",3]
[21112006,"Agapornis roseicollis pale fallow D aqua",null,"02",3]
[21112007,"Agapornis roseicollis pale fallow DD aqua",null,"02",3]
[21112008,"Agapornis roseicollis pale fallow violet aqua",null,"02",3]
[21112009,"Agapornis roseicollis pale fallow turquoise",null,"02",3]
[21112010,"Agapornis roseicollis pale falllow D turquoise",null,"02",3]
[21112011,"Agapornis roseicollis pale fallow DD turquoise",null,"02",3]
[21112012,"Agapornis roseicollis pale fallow violet turquoise",null,"02",3]
[21112013,"Agapornis roseicollis pale fallow blauw",null,"02",3]
[21112014,"Agapornis roseicollis pale fallow D blauw",null,"02",3]
[21112015,"Agapornis roseicollis pale fallow DD blauw",null,"02",3]
[21112016,"Agapornis roseicollis pale fallow violetblauw",null,"02",3]
[21112017,"Agapornis roseicollis pale fallow oranjemasker groen",null,"02",3]
[21112018,"Agapornis roseicollis pale fallow oranjemasker D groen",null,"02",3]
[21112019,"Agapornis roseicollis pale fallow oranjemasker DD groen",null,"02",3]
[21112020,"Agapornis roseicollis pale fallow oranjemasker violet groen",null,"02",3]
[21112021,"Agapornis roseicollis palle fallow pale headed groen serie (incl.alle mut.)",null,"02",3]
[21113001,"Agapornis roseicollis DF misty groen",null,"02",3]
[21113002,"Agapornis roseicollis DF misty aqua",null,"02",3]
[21113003,"Agapornis roseicollis DF misty turquoise",null,"02",3]
[21113004,"Agapornis roseicollis DF misty blauw",null,"02",3]
[21115001,"Agapornis roseicollis oranjemasker groen",null,"02",3]
[21115002,"Agapornis roseicollis oranjemasker D groen",null,"02",3]
[21115003,"Agapornis roseicollis oranjemasker DD groen",null,"02",3]
[21115004,"Agapornis roseicollis oranjemasker violet groen",null,"02",3]
[21115005,"Agapornis roseicollis pale headed groen serie (incl.alle mut.)",null,"02",3]
[21116001,"Agapornis roseicollis opaline groen",null,"02",3]
[21116002,"Agapornis roseicollis opaline D groen",null,"02",3]
[21116003,"Agapornis roseicollis opaline DD groen",null,"02",3]
[21116004,"Agapornis roseicollis opaline violet groen",null,"02",3]
[21116005,"Agapornis roseicollis opaline aqua",null,"02",3]
[21116006,"Agapornis roseicollis opaline D aqua",null,"02",3]
[21116007,"Agapornis roseicollis opaline DD aqua",null,"02",3]
[21116008,"Agapornis roseicollis opaline violet aqua",null,"02",3]
[21116009,"Agapornis roseicollis opaline turquoise",null,"02",3]
[21116010,"Agapornis roseicollis opaline D turquoise",null,"02",3]
[21116011,"Agapornis roseicollis opaline DD turquoise",null,"02",3]
[21116012,"Agapornis roseicollis opaline violet turquoise",null,"02",3]
[21116013,"Agapornis roseicollis opaline blauw",null,"02",3]
[21116014,"Agapornis roseicollis opaline D blauw",null,"02",3]
[21116015,"Agapornis roseicollis opaline DD blauw",null,"02",3]
[21116016,"Agapornis roseicollis opaline violetblauw",null,"02",3]
[21117001,"Agapornis roseicollis opaline-cinnamon groen",null,"02",3]
[21117002,"Agapornis roseicollis opaline-cinnamon D groen",null,"02",3]
[21117003,"Agapornis roseicollis opaline-cinnamon DD groen",null,"02",3]
[21117004,"Agapornis roseicollis opaline-cinnamon violet groen",null,"02",3]
[21117005,"Agapornis roseicollis opaline-cinnamon aqua",null,"02",3]
[21117006,"Agapornis roseicollis opaline-cinnamon D aqua",null,"02",3]
[21117007,"Agapornis roseicollis opaline-cinnamon DD aqua",null,"02",3]
[21117008,"Agapornis roseicollis opaline-cinnamon violet  aqua",null,"02",3]
[21117009,"Agapornis roseicollis opaline-cinnamon turquoise",null,"02",3]
[21117010,"Agapornis roseicollis opaline-cinnamon D turquoise",null,"02",3]
[21117011,"Agapornis roseicollis opaline-cinnamon DD turquoise",null,"02",3]
[21117012,"Agapornis roseicollis opaline-cinnamon violet turquoise",null,"02",3]
[21117013,"Agapornis roseicollis opaline-cinnamon blauw",null,"02",3]
[21117014,"Agapornis roseicollis opaline-cinnamon D blauw",null,"02",3]
[21117015,"Agapornis roseicollis opaline-cinnamon DD blauw",null,"02",3]
[21117016,"Agapornis roseicollis opaline-cinnamon violetblauw",null,"02",3]
[21117017,"Agapornis roseicollis opaline-cinnamon oranjemasker groen",null,"02",3]
[21117018,"Agapornis roseicollis opaline-cinnamon oranjemasker D groen",null,"02",3]
[21117019,"Agapornis roseicollis opaline-cinnamon oranjemasker DD groen",null,"02",3]
[21117020,"Agapornis roseicollis opaline-cinnamon oranjemasker violet groen",null,"02",3]
[21117021,"Agapornis roseicollis opaline-cinnamon pale headed groen",null,"02",3]
[21118001,"Agapornis roseicollis opaline-pallid groen",null,"02",3]
[21118002,"Agapornis roseicollis opaline-pallid D groen",null,"02",3]
[21118003,"Agapornis roseicollis opaline-pallid DD groen",null,"02",3]
[21118004,"Agapornis roseicollis opaline-pallid violet groen",null,"02",3]
[21118005,"Agapornis roseicollis opaline-pallid aqua",null,"02",3]
[21118006,"Agapornis roseicollis opaline-pallid D aqua",null,"02",3]
[21118007,"Agapornis roseicollis opaline-pallid DD aqua",null,"02",3]
[21118008,"Agapornis roseicollis opaline-pallid violet aqua",null,"02",3]
[21118009,"Agapornis roseicollis opaline-pallid turquoise",null,"02",3]
[21118010,"Agapornis roseicollis opaline-pallid D turquoise",null,"02",3]
[21118011,"Agapornis roseicollis opaline-pallid DD turquoise",null,"02",3]
[21118012,"Agapornis roseicollis opaline-pallid violet turquoise",null,"02",3]
[21118013,"Agapornis roseicollis opaline-pallid blauw",null,"02",3]
[21118014,"Agapornis roseicollis opaline-pallid D blauw",null,"02",3]
[21118015,"Agapornis roseicollis opaline-pallid DD blauw",null,"02",3]
[21118016,"Agapornis roseicollis opaline-pallid violetblauw",null,"02",3]
[21118017,"Agapornis roseicollis opaline-pallid oranjemasker groen",null,"02",3]
[21118018,"Agapornis roseicollis opaline-pallid oranjemasker D groen",null,"02",3]
[21118019,"Agapornis roseicollis opaline-pallid oranjemasker DD groen",null,"02",3]
[21118020,"Agapornis roseicollis opaline-pallid oranjemasker violet groen",null,"02",3]
[21118021,"Agapornis roseicollis opaline-pallid pale headed groen serie (incl.alle mut.)",null,"02",3]
[21119001,"Agapornis roseicollis opaline-ino groen",null,"02",3]
[21119002,"Agapornis roseicollis opaline-ino aqua",null,"02",3]
[21119003,"Agapornis roseicollis opaline-ino turquoise",null,"02",3]
[21119004,"Agapornis roseicollis opaline-ino blauw",null,"02",3]
[21119005,"Agapornis roseicollis opaline-ino oranjemasker groen",null,"02",3]
[21119006,"Agapornis roseicollis opaline-ino pale headed groen",null,"02",3]
[21120001,"Agapornis roseicollis opaline dilute groen",null,"02",3]
[21120002,"Agapornis roseicollis opaline dilute D groen",null,"02",3]
[21120003,"Agapornis roseicollis opaline dilute DD groen",null,"02",3]
[21120004,"Agapornis roseicollis opaline dilute violet groen",null,"02",3]
[21120005,"Agapornis roseicollis opaline dilute aqua",null,"02",3]
[21120006,"Agapornis roseicollis opaline dilute D aqua",null,"02",3]
[21120007,"Agapornis roseicollis opaline dilute DD aqua",null,"02",3]
[21120008,"Agapornis roseicollis opaline dilute violet aqua",null,"02",3]
[21120009,"Agapornis roseicollis opaline dilute turquoise",null,"02",3]
[21120010,"Agapornis roseicollis opaline dilute D turquoise",null,"02",3]
[21120011,"Agapornis roseicollis opaline dilute DD turquoise",null,"02",3]
[21120012,"Agapornis roseicollis opaline dilute violet turquoise",null,"02",3]
[21120013,"Agapornis roseicollis opaline dilute blauw",null,"02",3]
[21120014,"Agapornis roseicollis opaline dilute D blauw",null,"02",3]
[21120015,"Agapornis roseicollis opaline dilute DD blauw",null,"02",3]
[21120016,"Agapornis roseicollis opaline dilute violetblauw",null,"02",3]
[21120017,"Agapornis roseicollis opaline dilute oranjemasker groen",null,"02",3]
[21120018,"Agapornis roseicollis opaline dilute oranjemasker D groen",null,"02",3]
[21120019,"Agapornis roseicollis opaline dilute oranjemasker DD groen",null,"02",3]
[21120020,"Agapornis roseicollis opaline dilute oranjemasker violet groen",null,"02",3]
[21120021,"Agapornis roseicollis opaline dilute pale headed groen (incl.alle mut.)",null,"02",3]
[21121001,"Agapornis roseicollis opaline marbled groen",null,"02",3]
[21121002,"Agapornis roseicollis opaline marbled D groen",null,"02",3]
[21121003,"Agapornis roseicollis opaline marbled DD groen",null,"02",3]
[21121004,"Agapornis roseicollis opaline marbled violet groen",null,"02",3]
[21121005,"Agapornis roseicollis opaline marbled aqua",null,"02",3]
[21121006,"Agapornis roseicollis opaline marbled D aqua",null,"02",3]
[21121007,"Agapornis roseicollis opaline marbled DD aqua",null,"02",3]
[21121008,"Agapornis roseicollis opaline marbled violet aqua",null,"02",3]
[21121009,"Agapornis roseicollis opaline marbled turquoise",null,"02",3]
[21121010,"Agapornis roseicollis opaline marbled D turquoise",null,"02",3]
[21121011,"Agapornis roseicollis opaline marbled DD turquoise",null,"02",3]
[21121012,"Agapornis roseicollis opaline marbled violet turquoise",null,"02",3]
[21121013,"Agapornis roseicollis opaline marbled blauw",null,"02",3]
[21121014,"Agapornis roseicollis opaline marbled D blauw",null,"02",3]
[21121015,"Agapornis roseicollis opaline marbled DD blauw",null,"02",3]
[21121016,"Agapornis roseicollis opaline marbled violetblauw",null,"02",3]
[21121017,"Agapornis roseicollis opaline marbled oranjemasker groen",null,"02",3]
[21121018,"Agapornis roseicollis opaline marbled oranjemasker D groen",null,"02",3]
[21121019,"Agapornis roseicollis opaline marbled oranjemasker DD groen",null,"02",3]
[21121020,"Agapornis roseicollis opaline marbled oranjemasker violet groen",null,"02",3]
[21121021,"Agapornis roseicollis opaline marbled pale headed groen (incl.alle mut.)",null,"02",3]
[21122001,"Agapornis roseicollis opaline bronze fallow groen",null,"02",3]
[21122002,"Agapornis roseicollis opaline bronze fallow D groen",null,"02",3]
[21122003,"Agapornis roseicollis opaline bronze fallow DD groen",null,"02",3]
[21122004,"Agapornis roseicollis opaline bronze fallow violet groen",null,"02",3]
[21122005,"Agapornis roseicollis opaline bronze fallow aqua",null,"02",3]
[21122006,"Agapornis roseicollis opaline bronze fallow D aqua",null,"02",3]
[21122007,"Agapornis roseicollis opaline bronze fallow DD aqua",null,"02",3]
[21122008,"Agapornis roseicollis opaline bronze fallow violet aqua",null,"02",3]
[21122009,"Agapornis roseicollis opaline bronze fallow turquoise",null,"02",3]
[21122010,"Agapornis roseicollis opaline bronze fallow D turquoise",null,"02",3]
[21122011,"Agapornis roseicollis opaline bronze fallow DD turquoise",null,"02",3]
[21122012,"Agapornis roseicollis opaline bronze fallow violet turquoise",null,"02",3]
[21122013,"Agapornis roseicollis opaline bronze fallow blauw",null,"02",3]
[21122014,"Agapornis roseicollis opaline bronze fallow D blauw",null,"02",3]
[21122015,"Agapornis roseicollis opaline bronze fallow DD blauw",null,"02",3]
[21122016,"Agapornis roseicollis opaline bronze fallow violetblauw",null,"02",3]
[21122017,"Agapornis roseicollis opaline bronze fallow oranjemasker groen",null,"02",3]
[21122018,"Agapornis roseicollis opaline bronze fallow oranjemasker D groen",null,"02",3]
[21122019,"Agapornis roseicollis opaline bronze fallow oranjemasker DD groen",null,"02",3]
[21122020,"Agapornis roseicollis opaline bronze fallow oranjemasker violet groen",null,"02",3]
[21122021,"Agap.roseicollis opaline bronze fallow pale headed gr.serie (incl.alle mut.)",null,"02",3]
[21123001,"Agapornis roseicollis opaline pale fallow groen",null,"02",3]
[21123002,"Agapornis roseicollis opaline pale fallow D groen",null,"02",3]
[21123003,"Agapornis roseicollis opaline pale fallow DD groen",null,"02",3]
[21123004,"Agapornis roseicollis opaline pale fallow violet groen",null,"02",3]
[21123005,"Agapornis roseicollis opaline pale fallow aqua",null,"02",3]
[21123006,"Agapornis roseicollis opaline pale fallow D aqua",null,"02",3]
[21123007,"Agapornis roseicollis opaline pale fallow DD aqua",null,"02",3]
[21123008,"Agapornis roseicollis opaline pale fallow violet aqua",null,"02",3]
[21123009,"Agapornis roseicollis opaline pale fallow turquoise",null,"02",3]
[21123010,"Agapornis roseicollis opaline pale fallow D turquoise",null,"02",3]
[21123011,"Agapornis roseicollis opaline pale fallow DD turquoise",null,"02",3]
[21123012,"Agapornis roseicollis opaline pale fallow violet turquoise",null,"02",3]
[21123013,"Agapornis roseicollis opaline pale fallow blauw",null,"02",3]
[21123014,"Agapornis roseicollis opaline pale fallow D blauw",null,"02",3]
[21123015,"Agapornis roseicollis opaline pale fallow DD blauw",null,"02",3]
[21123016,"Agapornis roseicollis opaline pale fallow violetblauw",null,"02",3]
[21123017,"Agapornis roseicollis opaline pale fallow oranjemasker groen",null,"02",3]
[21123018,"Agapornis roseicollis opaline pale fallow oranjemasker D groen",null,"02",3]
[21123019,"Agapornis roseicollis opaline pale fallow oranjemasker DD groen",null,"02",3]
[21123020,"Agapornis roseicollis opaline pale fallow oranjemasker violet groen",null,"02",3]
[21123021,"Agap. roseicollis opaline pale fallow pale headed groen serie (incl.alle mut.)",null,"02",3]
[21124001,"Agapornis roseicollis opaline DF misty groen",null,"02",3]
[21124002,"Agapornis roseicollis opaline DF misty aqua",null,"02",3]
[21124003,"Agapornis roseicollis opaline DF misty turquoise",null,"02",3]
[21124004,"Agapornis roseicollis opaline DF misty blauw",null,"02",3]
[21125001,"Agapornis roseicollis opaline oranjemasker groen",null,"02",3]
[21125002,"Agapornis roseicollis opaline oranjemasker D groen",null,"02",3]
[21125003,"Agapornis roseicollis opaline oranjemasker DD groen",null,"02",3]
[21125004,"Agapornis roseicollis opaline oranjemasker violet groen",null,"02",3]
[21126001,"Agapornis roseicollis recessief bont groen serie (incl.oranjemasker en opaline)",null,"02",3]
[21126002,"Agapornis roseicollis recessief bont aqua serie (incl.opaline)",null,"02",3]
[21126003,"Agapornis roseicollis recessief bont turquoise serie (incl. opaline)",null,"02",3]
[21126004,"Agapornis roseicollis recessief bont blauw serie (incl.opaline)",null,"02",3]
[21126005,"Agap. roseicollis dom.bont gr.serie (incl.oranjemasker, pale headed en opaline)",null,"02",3]
[21126006,"Agapornis roseicollis dominant bont aqua serie (incl.opaline)",null,"02",3]
[21126007,"Agapornis roseicollis dominant bont turquoise serie (incl.opaline)",null,"02",3]
[21126008,"Agapornis roseicollis dominant bont blauw serie (incl.opaline)",null,"02",3]
[21190900,"Agapornis roseicollis nieuwe nog niet erkende mut. en comb. m/p",null,"02",3]
[21190999,"Agapornis roseicollis nieuwe mut. en comb. m/p (in standaard)",null,"02",3]
[21201001,"Agapornis lilianae groen",null,"02",3]
[21202001,"Agapornis lilianae D groen",null,"02",3]
[21202002,"Agapornis lilianae DD groen",null,"02",3]
[21202003,"Agapornis lilianae violet groen",null,"02",3]
[21202004,"Agapornis lilianae slaty groen",null,"02",3]
[21203001,"Agapornis lilianae turquoise",null,"02",3]
[21203002,"Agapornis lilianae D turquoise",null,"02",3]
[21203003,"Agapornis lilianae DD turquoise",null,"02",3]
[21203004,"Agapornis lilianae violet turquoise",null,"02",3]
[21203005,"Agapornis lilianae slaty turquoise",null,"02",3]
[21204001,"Agapornis lilianae blauw",null,"02",3]
[21204002,"Agapornis lilianae D blauw",null,"02",3]
[21204003,"Agapornis lilianae DD blauw",null,"02",3]
[21204004,"Agapornis lilianae violetblauw",null,"02",3]
[21204005,"Agapornis lilianae slaty blauw",null,"02",3]
[21205001,"Agapornis lilianae EF gezoomd groen",null,"02",3]
[21205002,"Agapornis lilianae EF gezoomd D groen",null,"02",3]
[21205003,"Agapornis lilianae EF gezoomd DD groen",null,"02",3]
[21205004,"Agapornis lilianae EF gezoomd violet groen",null,"02",3]
[21205005,"Agapornis lilianae EF gezoomd slaty groen",null,"02",3]
[21205006,"Agapornis lilianae EF gezoomd turquoise",null,"02",3]
[21205007,"Agapornis lilianae EF gezoomd D turquoise",null,"02",3]
[21205008,"Agapornis lilianae EF gezoomd DD turquoise",null,"02",3]
[21205009,"Agapornis lilianae EF gezoomd violet turquoise",null,"02",3]
[21205010,"Agapornis lilianae EF gezoomd slaty turquoise",null,"02",3]
[21205011,"Agapornis lilianae EF gezoomd blauw",null,"02",3]
[21205012,"Agapornis lilianae EF gezoomd D blauw",null,"02",3]
[21205013,"Agapornis lilianae EF gezoomd DD blauw",null,"02",3]
[21205014,"Agapornis lilianae EF gezoomd violetblauw",null,"02",3]
[21205015,"Agapornis lilianae EF gezoomd slaty blauw",null,"02",3]
[21206001,"Agapornis lilianae DF gezoomd groen",null,"02",3]
[21206002,"Agapornis lilianae DF gezoomd D groen",null,"02",3]
[21206003,"Agapornis lilianae DF gezoomd DD groen",null,"02",3]
[21206004,"Agapornis lilianae DF gezoomd violet groen",null,"02",3]
[21206005,"Agapornis lilianae DF gezoomd slaty groen",null,"02",3]
[21206006,"Agapornis lilianae DF gezoomd turquoise",null,"02",3]
[21206007,"Agapornis lilianae DF gezoomd D turquoise",null,"02",3]
[21206008,"Agapornis lilianae DF gezoomd DD turquoise",null,"02",3]
[21206009,"Agapornis lilianae DF gezoomd violet turquoise",null,"02",3]
[21206010,"Agapornis lilianae DF gezoomd slaty turquoise",null,"02",3]
[21206011,"Agapornis lilianae DF gezoomd blauw",null,"02",3]
[21206012,"Agapornis lilianae DF gezoomd D blauw",null,"02",3]
[21206013,"Agapornis lilianae DF gezoomd DD blauw",null,"02",3]
[21206014,"Agapornis lilianae DF gezoomd violetblauw",null,"02",3]
[21206015,"Agapornis lilianae DF gezoomd slaty blauw",null,"02",3]
[21207001,"Agapornis lilianae pastel groen",null,"02",3]
[21207002,"Agapornis lilianae pastel D groen",null,"02",3]
[21207003,"Agapornis lilianae pastel DD groen",null,"02",3]
[21207004,"Agapornis lilianae pastel violet groen",null,"02",3]
[21207005,"Agapornis lilianae pastel turquoise",null,"02",3]
[21207006,"Agapornis lilianae pastel D turquoise",null,"02",3]
[21207007,"Agapornis lilianae pastel DD turquoise",null,"02",3]
[21207008,"Agapornis lilianae pastel violet turquoise",null,"02",3]
[21207009,"Agapornis lilianae pastel blauw",null,"02",3]
[21207010,"Agapornis lilianae pastel D blauw",null,"02",3]
[21207011,"Agapornis lilianae pastel DD blauw",null,"02",3]
[21207012,"Agapornis lilianae pastel violetblauw",null,"02",3]
[21208001,"Agapornis lilianae dilute groen",null,"02",3]
[21208002,"Agapornis lilianae dilute D groen",null,"02",3]
[21208003,"Agapornis lilianae dilute DD groen",null,"02",3]
[21208004,"Agapornis lilianae dilute violet groen",null,"02",3]
[21208005,"Agapornis lilianae dilute slaty groen",null,"02",3]
[21208006,"Agapornis lilianae dilute turquoise",null,"02",3]
[21208007,"Agapornis lilianae dilute D turquoise",null,"02",3]
[21208008,"Agapornis lilianae dilute DD turquoise",null,"02",3]
[21208009,"Agapornis lilianae dilute violet turquoise",null,"02",3]
[21208010,"Agapornis lilianae dilute slaty turquoise",null,"02",3]
[21208011,"Agapornis lilianae dilute blauw",null,"02",3]
[21208012,"Agapornis lilianae dilute D blauw",null,"02",3]
[21208013,"Agapornis lilianae dilute DD blauw",null,"02",3]
[21208014,"Agapornis lilianae dilute violetblauw",null,"02",3]
[21208015,"Agapornis lilianae dilute slaty blauw",null,"02",3]
[21209001,"Agapornis lilianae EF euwing groen",null,"02",3]
[21209002,"Agapornis lilianae EF euwing D groen",null,"02",3]
[21209003,"Agapornis lilianae EF euwing DD groen",null,"02",3]
[21209004,"Agapornis lilianae EF euwing violet groen",null,"02",3]
[21209010,"Agapornis lilianae EF euwing turquoise",null,"02",3]
[21209011,"Agapornis lilianae EF euwing D turquoise",null,"02",3]
[21209012,"Agapornis lilianae EF euwing DD turquoise",null,"02",3]
[21209013,"Agapornis lilianae EF euwing violet turquoise",null,"02",3]
[21209020,"Agapornis lilianae EF euwing blauw",null,"02",3]
[21209021,"Agapornis lilianae EF euwing D blauw",null,"02",3]
[21209022,"Agapornis lilianae EF euwing DD blauw",null,"02",3]
[21209023,"Agapornis lilianae EF euwing violetblauw",null,"02",3]
[21210001,"Agapornis lilianae DF misty groen",null,"02",3]
[21210002,"Agapornis lilianae DF misty turquoise",null,"02",3]
[21210003,"Agapornis lilianae DF misty blauw",null,"02",3]
[21211001,"Agapornis lilianae DEC groen",null,"02",3]
[21211002,"Agapornis lilianae DEC turquoise",null,"02",3]
[21211003,"Agapornis lilianae DEC blauw",null,"02",3]
[21212001,"Agapornis lilianae NSL ino groen",null,"02",3]
[21212002,"Agapornis lilianae NSL ino turquoise",null,"02",3]
[21212003,"Agapornis lilianae NSL ino blauw",null,"02",3]
[21213001,"Agapornis lilianae recessief bont groen serie",null,"02",3]
[21213002,"Agapornis lilianae recessief bont turquoise serie",null,"02",3]
[21213003,"Agapornis lilianae recessief bont blauw serie",null,"02",3]
[21213004,"Agapornis lilianae dominant bont groen serie",null,"02",3]
[21213005,"Agapornis lilianae dominant bont turquoise serie",null,"02",3]
[21213006,"Agapornis lilianae dominant bont blauw serie",null,"02",3]
[21214001,"Agapornis lilianae opaline groen",null,"02",3]
[21214010,"Agapornis lilianae opaline turquoise",null,"02",3]
[21214030,"Agapornis lilianae opaline blauw",null,"02",3]
[21220001,"Agapornis lilianae opaline dilute groen",null,"02",3]
[21220010,"Agapornis lilianae opaline dilute turquoise",null,"02",3]
[21220030,"Agapornis lilianae opaline dilute blauw",null,"02",3]
[21290900,"Agapornis lilianae nieuwe nog niet erkende mut. en comb. m/p",null,"02",3]
[21290999,"Agapornis lilianae nieuwe mut. en comb. m/p (in standaard)",null,"02",3]
[21301001,"Agapornis nigrigenis groen",null,"02",3]
[21302001,"Agapornis nigrigenis D groen",null,"02",3]
[21302002,"Agapornis nigrigenis DD groen",null,"02",3]
[21302003,"Agapornis nigrigenis violet groen",null,"02",3]
[21302004,"Agapornis nigrigenis slaty groen",null,"02",3]
[21303001,"Agapornis nigrigenis turquoise",null,"02",3]
[21303002,"Agapornis nigrigenis D turquoise",null,"02",3]
[21303003,"Agapornis nigrigenis DD turquoise",null,"02",3]
[21303004,"Agapornis nigrigenis violet turquoise",null,"02",3]
[21303005,"Agapornis nigrigenis slaty turquoise",null,"02",3]
[21304001,"Agapornis nigrigenis blauw",null,"02",3]
[21304002,"Agapornis nigrigenis D blauw",null,"02",3]
[21304003,"Agapornis nigrigenis DD blauw",null,"02",3]
[21304004,"Agapornis nigrigenis violetblauw",null,"02",3]
[21304005,"Agapornis nigrigenis slaty blauw",null,"02",3]
[21305001,"Agapornis nigrigenis EF gezoomd groen",null,"02",3]
[21305002,"Agapornis nigrigenis EF gezoomd D groen",null,"02",3]
[21305003,"Agapornis nigrigenis EF gezoomd DD groen",null,"02",3]
[21305004,"Agapornis nigrigenis EF gezoomd violet groen",null,"02",3]
[21305005,"Agapornis nigrigenis EF gezoomd slaty groen",null,"02",3]
[21305006,"Agapornis nigrigenis EF gezoomd turquoise",null,"02",3]
[21305007,"Agapornis nigrigenis EF gezoomd D turquoise",null,"02",3]
[21305008,"Agapornis nigrigenis EF gezoomd DD turquoise",null,"02",3]
[21305009,"Agapornis nigrigenis EF gezoomd violet turquoise",null,"02",3]
[21305010,"Agapornis nigrigenis EF gezoomd slaty turquoise",null,"02",3]
[21305011,"Agapornis nigrigenis EF gezoomd blauw",null,"02",3]
[21305012,"Agapornis nigrigenis EF gezoomd D blauw",null,"02",3]
[21305013,"Agapornis nigrigenis EF gezoomd DD blauw",null,"02",3]
[21305014,"Agapornis nigrigenis EF gezoomd violetblauw",null,"02",3]
[21305015,"Agapornis nigrigenis EF gezoomd slaty blauw",null,"02",3]
[21306001,"Agapornis nigrigenis DF gezoomd groen",null,"02",3]
[21306002,"Agapornis nigrigenis DF gezoomd D groen",null,"02",3]
[21306003,"Agapornis nigrigenis DF gezoomd DD groen",null,"02",3]
[21306004,"Agapornis nigrigenis DF gezoomd violet groen",null,"02",3]
[21306005,"Agapornis nigrigenis DF gezoomd slaty groen",null,"02",3]
[21306006,"Agapornis nigrigenis DF gezoomd turquoise",null,"02",3]
[21306007,"Agapornis nigrigenis DF gezoomd D turquoise",null,"02",3]
[21306008,"Agapornis nigrigenis DF gezoomd DD turquoise",null,"02",3]
[21306009,"Agapornis nigrigenis DF gezoomd violet turquoise",null,"02",3]
[21306010,"Agapornis nigrigenis DF gezoomd slaty turquoise",null,"02",3]
[21306011,"Agapornis nigrigenis DF gezoomd blauw",null,"02",3]
[21306012,"Agapornis nigrigenis DF gezoomd D blauw",null,"02",3]
[21306013,"Agapornis nigrigenis DF gezoomd DD blauw",null,"02",3]
[21306014,"Agapornis nigrigenis DF gezoomd violetblauw",null,"02",3]
[21306015,"Agapornis nigrigenis DF gezoomd slaty blauw",null,"02",3]
[21307001,"Agapornis nigrigenis pastel groen",null,"02",3]
[21307002,"Agapornis nigrigenis pastel D groen",null,"02",3]
[21307003,"Agapornis nigrigenis pastel DD groen",null,"02",3]
[21307004,"Agapornis nigrigenis pastel violet groen",null,"02",3]
[21307005,"Agapornis nigrigenis pastel turquoise",null,"02",3]
[21307006,"Agapornis nigrigenis pastel D turquoise",null,"02",3]
[21307007,"Agapornis nigrigenis pastel DD turquoise",null,"02",3]
[21307008,"Agapornis nigrigenis pastel violet turquoise",null,"02",3]
[21307009,"Agapornis nigrigenis pastel blauw",null,"02",3]
[21307010,"Agapornis nigrigenis pastel D blauw",null,"02",3]
[21307011,"Agapornis nigrigenis pastel DD blauw",null,"02",3]
[21307012,"Agapornis nigrigenis pastel violetblauw",null,"02",3]
[21308001,"Agapornis nigrigenis dilute groen",null,"02",3]
[21308002,"Agapornis nigrigenis dilute D groen",null,"02",3]
[21308003,"Agapornis nigrigenis dilute DD groen",null,"02",3]
[21308004,"Agapornis nigrigenis dilute violet groen",null,"02",3]
[21308005,"Agapornis nigrigenis dilute slaty groen",null,"02",3]
[21308006,"Agapornis nigrigenis dilute turquoise",null,"02",3]
[21308007,"Agapornis nigrigenis dilute D turquoise",null,"02",3]
[21308008,"Agapornis nigrigenis dilute DD turquoise",null,"02",3]
[21308009,"Agapornis nigrigenis dilute violet turquoise",null,"02",3]
[21308010,"Agapornis nigrigenis dilute slaty turquoise",null,"02",3]
[21308011,"Agapornis nigrigenis dilute blauw",null,"02",3]
[21308012,"Agapornis nigrigenis dilute D blauw",null,"02",3]
[21308013,"Agapornis nigrigenis dilute DD blauw",null,"02",3]
[21308014,"Agapornis nigrigenis dilute violetblauw",null,"02",3]
[21308015,"Agapornis nigrigenis dilute slaty blauw",null,"02",3]
[21309001,"Agapornis nigrigenis EF euwing groen",null,"02",3]
[21309002,"Agapornis nigrigenis EF euwing D groen",null,"02",3]
[21309003,"Agapornis nigrigenis EF euwing DD groen",null,"02",3]
[21309004,"Agapornis nigrigenis EF euwing violet groen",null,"02",3]
[21309010,"Agapornis nigrigenis EF euwing turquoise",null,"02",3]
[21309011,"Agapornis nigrigenis EF euwing D turquoise",null,"02",3]
[21309012,"Agapornis nigrigenis EF euwing DD turquoise",null,"02",3]
[21309013,"Agapornis nigrigenis EF euwing violet turquoise",null,"02",3]
[21309020,"Agapornis nigrigenis EF euwing blauw",null,"02",3]
[21309021,"Agapornis nigrigenis EF euwing D blauw",null,"02",3]
[21309022,"Agapornis nigrigenis EF euwing DD blauw",null,"02",3]
[21309023,"Agapornis nigrigenis EF euwing violetblauw",null,"02",3]
[21310001,"Agapornis nigrigenis DF misty groen",null,"02",3]
[21310002,"Agapornis nigrigenis DF misty turquoise",null,"02",3]
[21310003,"Agapornis nigrigenis DF misty blauw",null,"02",3]
[21311001,"Agapornis nigrigenis DEC groen",null,"02",3]
[21311002,"Agapornis nigrigenis DEC turquoise",null,"02",3]
[21311003,"Agapornis nigrigenis DEC blauw",null,"02",3]
[21312001,"Agapornis nigrigenis NSL ino groen (lutino)",null,"02",3]
[21312002,"Agapornis nigrigenis NSL ino turquoise",null,"02",3]
[21312003,"Agapornis nigrigenis NSL ino blauw (albino)",null,"02",3]
[21313001,"Agapornis nigrigenis recessief bont groen serie",null,"02",3]
[21313002,"Agapornis nigrigenis recessief bont turquoise serie",null,"02",3]
[21313003,"Agapornis nigrigenis recessief bont blauw serie",null,"02",3]
[21313004,"Agapornis nigrigenis dominant bont groen serie",null,"02",3]
[21313005,"Agapornis nigrigenis dominant bont turquoise serie",null,"02",3]
[21313006,"Agapornis nigrigenis dominant bont blauw serie",null,"02",3]
[21390900,"Agapornis nigrigenis nieuwe nog niet erkende mut. en comb. m/p",null,"02",3]
[21390999,"Agapornis nigrigenis nieuwe mut. en comb. m/p (in standaard)",null,"02",3]
[21401001,"Agapornis fischeri groen",null,"02",3]
[21402001,"Agapornis fischeri D groen",null,"02",3]
[21402002,"Agapornis fischeri DD groen",null,"02",3]
[21402003,"Agapornis fischeri violet groen",null,"02",3]
[21402004,"Agapornis fischeri slaty groen",null,"02",3]
[21403001,"Agapornis fischeri turquoise",null,"02",3]
[21403002,"Agapornis fischeri D turquoise",null,"02",3]
[21403003,"Agapornis fischeri DD turquoise",null,"02",3]
[21403004,"Agapornis fischeri violet turquoise",null,"02",3]
[21403005,"Agapornis fischeri slaty turquoise",null,"02",3]
[21404001,"Agapornis fischeri blauw",null,"02",3]
[21404002,"Agapornis fischeri D blauw",null,"02",3]
[21404003,"Agapornis fischeri DD blauw",null,"02",3]
[21404004,"Agapornis fischeri violetblauw",null,"02",3]
[21404005,"Agapornis fischeri slaty blauw",null,"02",3]
[21405001,"Agapornis fischeri EF gezoomd groen",null,"02",3]
[21405002,"Agapornis fischeri EF gezoomd D groen",null,"02",3]
[21405003,"Agapornis fischeri EF gezoomd DD groen",null,"02",3]
[21405004,"Agapornis fischeri EF gezoomd violet groen",null,"02",3]
[21405005,"Agapornis fischeri EF gezoomd slaty groen",null,"02",3]
[21405006,"Agapornis fischeri EF gezoomd turquoise",null,"02",3]
[21405007,"Agapornis fischeri EF gezoomd D turquoise",null,"02",3]
[21405008,"Agapornis fischeri EF gezoomd DD turquoise",null,"02",3]
[21405009,"Agapornis fischeri EF gezoomd violet turquoise",null,"02",3]
[21405010,"Agapornis fischeri EF gezoomd slaty turquoise",null,"02",3]
[21405011,"Agapornis fischeri EF gezoomd blauw",null,"02",3]
[21405012,"Agapornis fischeri EF gezoomd D blauw",null,"02",3]
[21405013,"Agapornis fischeri EF gezoomd DD blauw",null,"02",3]
[21405014,"Agapornis fischeri EF gezoomd violetblauw",null,"02",3]
[21405015,"Agapornis fischeri EF gezoomd slaty blauw",null,"02",3]
[21406001,"Agapornis fischeri DF gezoomd groen",null,"02",3]
[21406002,"Agapornis fischeri DF gezoomd D groen",null,"02",3]
[21406003,"Agapornis fischeri DF gezoomd DD groen",null,"02",3]
[21406004,"Agapornis fischeri DF gezoomd violet groen",null,"02",3]
[21406005,"Agapornis fischeri DF gezoomd slaty groen",null,"02",3]
[21406006,"Agapornis fischeri DF gezoomd turquoise",null,"02",3]
[21406007,"Agapornis fischeri DF gezoomd D turquoise",null,"02",3]
[21406008,"Agapornis fischeri DF gezoomd DD turquoise",null,"02",3]
[21406009,"Agapornis fischeri DF gezoomd violet turquoise",null,"02",3]
[21406010,"Agapornis fischeri DF gezoomd slaty turquoise",null,"02",3]
[21406011,"Agapornis fischeri DF gezoomd blauw",null,"02",3]
[21406012,"Agapornis fischeri DF gezoomd D blauw",null,"02",3]
[21406013,"Agapornis fischeri DF gezoomd DD blauw",null,"02",3]
[21406014,"Agapornis fischeri DF gezoomd violetblauw",null,"02",3]
[21406015,"Agapornis fischeri DF gezoomd slaty blauw",null,"02",3]
[21409001,"Agapornis fischeri pastel groen",null,"02",3]
[21409002,"Agapornis fischeri pastel D groen",null,"02",3]
[21409003,"Agapornis fischeri pastel DD groen",null,"02",3]
[21409004,"Agapornis fischeri pastel violet groen",null,"02",3]
[21409005,"Agapornis fischeri pastel turquoise",null,"02",3]
[21409006,"Agapornis fischeri pastel D turquoise",null,"02",3]
[21409007,"Agapornis fischeri pastel DD turquoise",null,"02",3]
[21409008,"Agapornis fischeri pastel violet turquoise",null,"02",3]
[21409009,"Agapornis fischeri pastel blauw",null,"02",3]
[21409010,"Agapornis fischeri pastel D blauw",null,"02",3]
[21409011,"Agapornis fischeri pastel DD blauw",null,"02",3]
[21409012,"Agapornis fischeri pastel violetblauw",null,"02",3]
[21410001,"Agapornis fischeri dilute groen",null,"02",3]
[21410002,"Agapornis fischeri dilute D groen",null,"02",3]
[21410003,"Agapornis fischeri dilute DD groen",null,"02",3]
[21410004,"Agapornis fischeri dilute violet groen",null,"02",3]
[21410005,"Agapornis fischeri dilute slaty groen",null,"02",3]
[21410006,"Agapornis fischeri dilute turquoise",null,"02",3]
[21410007,"Agapornis fischeri dilute D turquoise",null,"02",3]
[21410008,"Agapornis fischeri dilute DD turquoise",null,"02",3]
[21410009,"Agapornis fischeri dilute violet turquoise",null,"02",3]
[21410010,"Agapornis fischeri dilute slaty turquoise",null,"02",3]
[21410011,"Agapornis fischeri dilute blauw",null,"02",3]
[21410012,"Agapornis fischeri dilute D blauw",null,"02",3]
[21410013,"Agapornis fischeri dilute DD blauw",null,"02",3]
[21410014,"Agapornis fischeri dilute violetblauw",null,"02",3]
[21410015,"Agapornis fischeri dilute slaty blauw",null,"02",3]
[21411001,"Agapornis fischeri bronze fallow groen",null,"02",3]
[21411002,"Agapornis fischeri bronze fallow turquoise",null,"02",3]
[21411003,"Agapornis fischeri bronze fallow blauw",null,"02",3]
[21411004,"Agapornis fischeri pale fallow groen",null,"02",3]
[21411005,"Agapornis fischeri pale fallow turquoise",null,"02",3]
[21411006,"Agapornis fischeri pale fallow blauw",null,"02",3]
[21412010,"Agapornis fischeri pale groen",null,"02",3]
[21412020,"Agapornis fischeri pale turquoise",null,"02",3]
[21412040,"Agapornis fischeri pale blauw",null,"02",3]
[21413001,"Agapornis fischeri EF euwing groen",null,"02",3]
[21413002,"Agapornis fischeri EF euwing D groen",null,"02",3]
[21413003,"Agapornis fischeri EF euwing DD groen",null,"02",3]
[21413004,"Agapornis fischeri EF euwing violet groen",null,"02",3]
[21413010,"Agapornis fischeri EF euwing turquoise",null,"02",3]
[21413011,"Agapornis fischeri EF euwing D turquoise",null,"02",3]
[21413012,"Agapornis fischeri EF euwing DD turquoise",null,"02",3]
[21413013,"Agapornis fischeri EF euwing violet turquoise",null,"02",3]
[21413020,"Agapornis fischeri EF euwing blauw",null,"02",3]
[21413021,"Agapornis fischeri EF euwing D blauw",null,"02",3]
[21413022,"Agapornis fischeri EF euwing DD blauw",null,"02",3]
[21413023,"Agapornis fischeri EF euwing violetblauw",null,"02",3]
[21414001,"Agapornis fischeri DF misty groen",null,"02",3]
[21414002,"Agapornis fischeri DF misty turquoise",null,"02",3]
[21414003,"Agapornis fischeri DF misty blauw",null,"02",3]
[21415001,"Agapornis fischeri DEC groen",null,"02",3]
[21415002,"Agapornis fischeri DEC turquoise",null,"02",3]
[21415003,"Agapornis fischeri DEC blauw",null,"02",3]
[21416001,"Agapornis fischeri NSL ino groen",null,"02",3]
[21416002,"Agapornis fischeri NSL ino turquoise",null,"02",3]
[21416003,"Agapornis fischeri NSL ino blauw",null,"02",3]
[21417001,"Agapornis fischeri recessief bont groen serie (Incl.opaline)",null,"02",3]
[21417002,"Agapornis fischeri recessief bont turquoise serie (Incl.opaline)",null,"02",3]
[21417003,"Agapornis fischeri recessief bont blauw serie (Incl.opaline)",null,"02",3]
[21417004,"Agapornis fischeri dominant bont groen serie (Incl.opaline)",null,"02",3]
[21417005,"Agapornis fischeri dominant bont turquoise serie (Incl.opaline)",null,"02",3]
[21417006,"Agapornis fischeri dominant bont blauw serie (Incl.opaline)",null,"02",3]
[21418001,"Agapornis fischeri opaline groen",null,"02",3]
[21418002,"Agapornis fischeri opaline D groen",null,"02",3]
[21418003,"Agapornis fischeri opaline DD groen",null,"02",3]
[21418004,"Agapornis fischeri opaline slaty groen",null,"02",3]
[21418005,"Agapornis fischeri opaline violet groen",null,"02",3]
[21419001,"Agapornis fischeri opaline turquoise",null,"02",3]
[21419002,"Agapornis fischeri opaline D turquoise",null,"02",3]
[21419003,"Agapornis fischeri opaline DD turquoise",null,"02",3]
[21419004,"Agapornis fischeri opaline violet turquoise",null,"02",3]
[21419005,"Agapornis fischeri opaline slaty turquoise",null,"02",3]
[21420001,"Agapornis fischeri opaline blauw",null,"02",3]
[21420002,"Agapornis fischeri opaline D blauw",null,"02",3]
[21420003,"Agapornis fischeri opaline DD blauw",null,"02",3]
[21420004,"Agapornis fischeri opaline violetblauw",null,"02",3]
[21420005,"Agapornis fischeri opaline slaty blauw",null,"02",3]
[21421001,"Agapornis fischeri opaline NSL ino groen",null,"02",3]
[21421002,"Agapornis fischeri opaline NSL ino turquoise",null,"02",3]
[21421003,"Agapornis fischeri opaline NSL ino blauw",null,"02",3]
[21422001,"Agapornis fischeri opaline pastel groen",null,"02",3]
[21422002,"Agapornis fischeri opaline pastel turquiose",null,"02",3]
[21422003,"Agapornis fischeri opaline pastel blauw",null,"02",3]
[21423001,"Agapornis fischeri opaline EF euwing groen",null,"02",3]
[21423002,"Agapornis fischeri opaline EF euwing D groen",null,"02",3]
[21423003,"Agapornis fischeri opaline EF euwing DD groen",null,"02",3]
[21423004,"Agapornis fischeri opaline EF euwing violet groen",null,"02",3]
[21423010,"Agapornis fischeri opaline EF euwing turquoise",null,"02",3]
[21423011,"Agapornis fischeri opaline EF euwing D turquoise",null,"02",3]
[21423012,"Agapornis fischeri opaline EF euwing DD turquoise",null,"02",3]
[21423013,"Agapornis fischeri opaline EF euwing violet turquoise",null,"02",3]
[21423020,"Agapornis fischeri opaline EF euwing blauw",null,"02",3]
[21423021,"Agapornis fischeri opaline EF euwing D blauw",null,"02",3]
[21423022,"Agapornis fischeri opaline EF euwing DD blauw",null,"02",3]
[21423023,"Agapornis fischeri opaline EF euwing violetblauw",null,"02",3]
[21490900,"Agapornis fischeri nieuwe nog niet erkende mut. en comb. m/p",null,"02",3]
[21490999,"Agapornis fischeri nieuwe mut. en comb. m/p (in standaard)",null,"02",3]
[21501001,"Agapornis personatus groen",null,"02",3]
[21502001,"Agapornis personatus D groen",null,"02",3]
[21502002,"Agapornis personatus DD groen",null,"02",3]
[21502003,"Agapornis personatus violet groen",null,"02",3]
[21503001,"Agapornis personatus turquoise",null,"02",3]
[21503002,"Agapornis personatus D turquoise",null,"02",3]
[21503003,"Agapornis personatus DD turquoise",null,"02",3]
[21503004,"Agapornis personatus violet turquoise",null,"02",3]
[21504001,"Agapornis personatus blauw",null,"02",3]
[21504002,"Agapornis personatus D blauw",null,"02",3]
[21504003,"Agapornis personatus DD blauw",null,"02",3]
[21504004,"Agapornis personatus violetblauw",null,"02",3]
[21506001,"Agapornis personatus EF gezoomd groen",null,"02",3]
[21506002,"Agapornis personatus EF gezoomd D groen",null,"02",3]
[21506003,"Agapornis personatus EF gezoomd DD groen",null,"02",3]
[21506004,"Agapornis personatus EF gezoomd violet groen",null,"02",3]
[21506005,"Agapornis personatus EF gezoomd slaty groen",null,"02",3]
[21506006,"Agapornis personatus EF gezoomd turquoise",null,"02",3]
[21506007,"Agapornis personatus EF gezoomd D turquoise",null,"02",3]
[21506008,"Agapornis personatus EF gezoomd DD turquoise",null,"02",3]
[21506009,"Agapornis personatus EF gezoomd violet turquoise",null,"02",3]
[21506010,"Agapornis personatus EF gezoomd slaty turquoise",null,"02",3]
[21506011,"Agapornis personatus EF gezoomd blauw",null,"02",3]
[21506012,"Agapornis personatus EF gezoomd D blauw",null,"02",3]
[21506013,"Agapornis personatus EF gezoomd DD blauw",null,"02",3]
[21506014,"Agapornis personatus EF gezoomd violetblauw",null,"02",3]
[21506015,"Agapornis personatus EF gezoomd slaty blauw",null,"02",3]
[21507001,"Agapornis personatus DF gezoomd groen",null,"02",3]
[21507002,"Agapornis personatus DF gezoomd D groen",null,"02",3]
[21507003,"Agapornis personatus DF gezoomd DD groen",null,"02",3]
[21507004,"Agapornis personatus DF gezoomd violet groen",null,"02",3]
[21507005,"Agapornis personatus DF gezoomd slaty groen",null,"02",3]
[21507006,"Agapornis personatus DF gezoomd turquoise",null,"02",3]
[21507007,"Agapornis personatus DF gezoomd D turquoise",null,"02",3]
[21507008,"Agapornis personatus DF gezoomd DD turquoise",null,"02",3]
[21507009,"Agapornis personatus DF gezoomd violet turquoise",null,"02",3]
[21507010,"Agapornis personatus DF gezoomd slaty turquoise",null,"02",3]
[21507011,"Agapornis personatus DF gezoomd blauw",null,"02",3]
[21507012,"Agapornis personatus DF gezoomd D blauw",null,"02",3]
[21507013,"Agapornis personatus DF gezoomd DD blauw",null,"02",3]
[21507014,"Agapornis personatus DF gezoomd violetblauw",null,"02",3]
[21507015,"Agapornis personatus DF gezoomd slaty blauw",null,"02",3]
[21508001,"Agapornis personatus pastel groen",null,"02",3]
[21508002,"Agapornis personatus pastel D groen",null,"02",3]
[21508003,"Agapornis personatus pastel DD groen",null,"02",3]
[21508004,"Agapornis personatus pastel violet groen",null,"02",3]
[21508005,"Agapornis personatus pastel turquoise",null,"02",3]
[21508006,"Agapornis personatus pastel D turquoise",null,"02",3]
[21508007,"Agapornis personatus pastel DD turquoise",null,"02",3]
[21508008,"Agapornis personatus pastel violet turquoise",null,"02",3]
[21508009,"Agapornis personatus pastel blauw",null,"02",3]
[21508010,"Agapornis personatus pastel D blauw",null,"02",3]
[21508011,"Agapornis personatus pastel DD blauw",null,"02",3]
[21508012,"Agapornis personatus pastel violetblauw",null,"02",3]
[21509001,"Agapornis personatus dilute groen",null,"02",3]
[21509002,"Agapornis personatus dilute D groen",null,"02",3]
[21509003,"Agapornis personatus dilute DD groen",null,"02",3]
[21509004,"Agapornis personatus dilute violet groen",null,"02",3]
[21509005,"Agapornis personatus dilute slaty groen",null,"02",3]
[21509006,"Agapornis personatus dilute turquoise",null,"02",3]
[21509007,"Agapornis personatus dilute D turquoise",null,"02",3]
[21509008,"Agapornis personatus dilute DD turquoise",null,"02",3]
[21509009,"Agapornis personatus dilute violet turquoise",null,"02",3]
[21509010,"Agapornis personatus dilute slaty turquoise",null,"02",3]
[21509011,"Agapornis personatus dilute blauw",null,"02",3]
[21509012,"Agapornis personatus dilute D blauw",null,"02",3]
[21509013,"Agapornis personatus dilute DD blauw",null,"02",3]
[21509014,"Agapornis personatus dilute violetblauw",null,"02",3]
[21509015,"Agapornis personatus dilute slaty blauw",null,"02",3]
[21510001,"Agapornis personatus bronze fallow groen serie",null,"02",3]
[21510002,"Agapornis personatus bronze fallow turquoise serie",null,"02",3]
[21510003,"Agapornis personatus bronze fallow blauw serie",null,"02",3]
[21510021,"Agapornis personatus pale fallow groen serie",null,"02",3]
[21510022,"Agapornis personatus pale fallow turquoise serie",null,"02",3]
[21510023,"Agapornis personatus pale fallow blauw serie",null,"02",3]
[21510041,"Agapornis personatus dun fallow groen serie",null,"02",3]
[21510042,"Agapornis personatus dun fallow turquoise serie",null,"02",3]
[21510043,"Agapornis personatus dun fallow blauw serie",null,"02",3]
[21511001,"Agapornis personatus EF euwing groen",null,"02",3]
[21511002,"Agapornis personatus EF euwing D groen",null,"02",3]
[21511003,"Agapornis personatus EF euwing DD groen",null,"02",3]
[21511004,"Agapornis personatus EF euwing violet groen",null,"02",3]
[21511010,"Agapornis personatus EF euwing turquoise",null,"02",3]
[21511011,"Agapornis personatus EF euwing D turquoise",null,"02",3]
[21511012,"Agapornis personatus EF euwing DD turquoise",null,"02",3]
[21511013,"Agapornis personatus EF euwing violet turquoise",null,"02",3]
[21511020,"Agapornis personatus EF euwing blauw",null,"02",3]
[21511021,"Agapornis personatus EF euwing D blauw",null,"02",3]
[21511022,"Agapornis personatus EF euwing DD blauw",null,"02",3]
[21511023,"Agapornis personatus EF euwing violetblauw",null,"02",3]
[21512001,"Agapornis personatus DF misty groen",null,"02",3]
[21512002,"Agapornis personatus DF misty turquoise",null,"02",3]
[21512003,"Agapornis personatus DF misty blauw",null,"02",3]
[21513001,"Agapornis personatus DEC groen",null,"02",3]
[21513002,"Agapornis personatus DEC turquoise",null,"02",3]
[21513003,"Agapornis personatus DEC blauw",null,"02",3]
[21514001,"Agapornis personatus NSL ino groen (lutino)",null,"02",3]
[21514002,"Agapornis personatus NSL ino turquoise",null,"02",3]
[21514003,"Agapornis personatus NSL ino blauw (albino)",null,"02",3]
[21515001,"Agapornis personatus recessief bont groen serie",null,"02",3]
[21515002,"Agapornis personatus recessief bont turquoise serie",null,"02",3]
[21515003,"Agapornis personatus recessief bont blauw serie",null,"02",3]
[21515004,"Agapornis personatus dominant bont groen serie",null,"02",3]
[21515005,"Agapornis personatus dominant bont turquoise serie",null,"02",3]
[21515006,"Agapornis personatus dominant bont blauw serie",null,"02",3]
[21590900,"Agapornis personatus nieuwe nog niet erkende mut. en comb. m/p",null,"02",3]
[21590999,"Agapornis personatus nieuwe mut. en comb. m/p (in standaard)",null,"02",3]
[21601001,"Agapornis taranta groen man",null,"02",3]
[21601002,"Agapornis taranta groen pop",null,"02",3]
[21602001,"Agapornis taranta D groen man",null,"02",3]
[21602002,"Agapornis taranta D groen pop",null,"02",3]
[21602003,"Agapornis taranta DD groen man",null,"02",3]
[21602004,"Agapornis taranta DD groen pop",null,"02",3]
[21603001,"Agapornis taranta turquoise man",null,"02",3]
[21603002,"Agapornis taranta turquoise pop",null,"02",3]
[21605001,"Agapornis taranta bronze fallow groen man",null,"02",3]
[21605002,"Agapornis taranta bronze fallow groen pop",null,"02",3]
[21605003,"Agapornis taranta pale fallow groen man",null,"02",3]
[21605004,"Agapornis taranta pale fallow groen pop",null,"02",3]
[21606001,"Agapornis taranta DF misty groen man",null,"02",3]
[21606002,"Agapornis taranta DF misty groen pop",null,"02",3]
[21690900,"Agapornis taranta nieuwe nog niet erkende mut. en comb. m/p",null,"02",3]
[21690999,"Agapornis taranta nieuwe mut. en comb. m/p (in standaard)",null,"02",3]
[21701001,"Agapornis pullarius groen man",null,"02",3]
[21701002,"Agapornis pullarius groen pop",null,"02",3]
[21710900,"Agapornis pullarius nieuwe nog niet erkende mut. en comb. m/p",null,"02",3]
[21710999,"Agapornis pullarius nieuwe mut. en comb. m/p (in standaard)",null,"02",3]
[21720001,"Agapornis canus groen man",null,"02",3]
[21720002,"Agapornis canus groen pop",null,"02",3]
[21790900,"Agapornis canus nieuwe nog niet erkende mut. en comb. m/p",null,"02",3]
[21790999,"Agapornis canus nieuwe mut. en comb. m/p (in standaard)",null,"02",3]
[22001001,"Catharinaparkiet groen",null,"02",3]
[22002001,"Catharinaparkiet D groen",null,"02",3]
[22002002,"Catharinaparkiet DD groen",null,"02",3]
[22003001,"Catharinaparkiet turquoise",null,"02",3]
[22003002,"Catharinaparkiet D turquoise",null,"02",3]
[22003003,"Catharinaparkiet DD turquoise",null,"02",3]
[22004001,"Catharinaparkiet blauw",null,"02",3]
[22004002,"Catharinaparkiet D blauw",null,"02",3]
[22004003,"Catharinaparkiet DD blauw",null,"02",3]
[22006001,"Catharinaparkiet EF grijsvleugel groen",null,"02",3]
[22006002,"Catharinaparkiet EF grijsvleugel D groen",null,"02",3]
[22006003,"Catharinaparkiet EF grijsvleugel DD groen",null,"02",3]
[22006005,"Catharinaparkiet EF grijsvleugel turquoise",null,"02",3]
[22006006,"Catharinaparkiet EF grijsvleugel D turquoise",null,"02",3]
[22006007,"Catharinaparkiet EF grijsvleugel DD turquoise",null,"02",3]
[22007001,"Catharinaparkiet DF grijsvleugel groen",null,"02",3]
[22007002,"Catharinaparkiet DF grijsvleugel D groen",null,"02",3]
[22007003,"Catharinaparkiet DF grijsvleugel DD groen",null,"02",3]
[22007005,"Catharinaparkiet DF grijsvleugel turquoise",null,"02",3]
[22007006,"Catharinaparkiet DF grijsvleugel D turquoise",null,"02",3]
[22007007,"Catharinaparkiet DF grijsvleugel DD turquoise",null,"02",3]
[22008001,"Catharinaparkiet EF grijsvleugel-SL ino",null,"02",3]
[22008003,"Catharinaparkiet EF grijsvleugel-SL ino turquoise",null,"02",3]
[22009001,"Catharinaparkiet SL ino groen",null,"02",3]
[22009002,"Catharinaparkiet SL ino turquoise",null,"02",3]
[22010001,"Catharinaparkiet DF misty groen",null,"02",3]
[22010002,"Catharinaparkiet DF misty turquoise",null,"02",3]
[22190900,"Catharinaparkiet nieuwe nog niet erkende mut. en comb. m/p",null,"02",3]
[22190999,"Catharinaparkiet nieuwe mut. en comb. m/p (in standaard)",null,"02",3]
[22200001,"Citroenparkiet groen man",null,"02",3]
[22200002,"Citroenparkiet groen pop",null,"02",3]
[22200003,"Roberts citroenparkiet groen man",null,"02",3]
[22200004,"Roberts citroenparkiet groen pop",null,"02",3]
[22200005,"Margaritaparkiet groen",null,"02",3]
[22200006,"Roodsnavelparkiet groen",null,"02",3]
[22200007,"Andesparkiet groen",null,"02",3]
[22200008,"Roodvoorhoofdparkiet groen",null,"02",3]
[22200009,"Aymaraparkiet groen",null,"02",3]
[22200999,"Niet genoemde Psilopsiagon- en Bolborhynchus soorten",null,"02",3]
[22390900,"Psilopsiagon- en Bolborhynchus nieuwe nog niet erkende mut. en comb.",null,"02",3]
[22390999,"Psilopsiagon- en Bolborhynchus nieuwe mut. en comb. (in standaard)",null,"02",3]
[23001001,"Bourkeparkiet wildkleur man",null,"07",4]
[23001002,"Bourkeparkiet wildkleur pop",null,"07",4]
[23002001,"Bourkeparkiet violet wildkleur man",null,"07",4]
[23002002,"Bourkeparkiet violet wildkleur pop",null,"07",4]
[23003001,"Bourkeparkiet bronze fallow man",null,"07",4]
[23003002,"Bourkeparkiet bronze fallow pop",null,"07",4]
[23003003,"Bourkeparkiet pale fallow man",null,"07",4]
[23003004,"Bourkeparkiet pale fallow pop",null,"07",4]
[23003005,"Bourkeparkiet recessief gezoomd man",null,"07",4]
[23003006,"Bourkeparkiet recessief gezoomd pop",null,"07",4]
[23004001,"Bourkeparkiet SL ino man",null,"07",4]
[23004002,"Bourkeparkiet SL ino pop",null,"07",4]
[23005001,"Bourkeparkiet opaline man",null,"07",4]
[23005002,"Bourkeparkiet opaline pop",null,"07",4]
[23005003,"Bourkeparkiet opaline-SL ino man",null,"07",4]
[23005004,"Bourkeparkiet opaline-SL ino pop",null,"07",4]
[23005005,"Bourkeparkiet opaline recessief gezoomd man",null,"07",4]
[23005006,"Bourkeparkiet opaline recessief gezoomd pop",null,"07",4]
[23005007,"Bourkeparkiet opaline bronze fallow man",null,"07",4]
[23005008,"Bourkeparkiet opaline bronze fallow pop",null,"07",4]
[23005009,"Bourkeparkiet opaline pale fallow man",null,"07",4]
[23005010,"Bourkeparkiet opaline pale fallow pop",null,"07",4]
[23190900,"Bourkeparkiet nieuwe nog niet erkende mut. en comb. m/p",null,"07",4]
[23190999,"Bourkeparkiet nieuwe mut. en comb. m/p (in standaard)",null,"07",4]
[23200001,"Splendidparkiet groen man",null,"07",4]
[23200002,"Splendidparkiet groen pop",null,"07",4]
[23210001,"Splendidparkiet aqua man",null,"07",4]
[23210002,"Splendidparkiet aqua pop",null,"07",4]
[23210003,"Splendidparkiet turquoise man",null,"07",4]
[23210004,"Splendidparkiet turquoise pop",null,"07",4]
[23211001,"Splendidparkiet blauw man",null,"07",4]
[23211002,"Splendidparkiet blauw pop",null,"07",4]
[23212001,"Splendidparkiet grijsgroen man",null,"07",4]
[23212002,"Splendidparkiet grijsgroen pop",null,"07",4]
[23212003,"Splendidparkiet grijs aqua man",null,"07",4]
[23212004,"Splendidparkiet grijs aqua pop",null,"07",4]
[23212005,"Splendidparkiet grijs turquoise man",null,"07",4]
[23212006,"Splendidparkiet grijs turquoise pop",null,"07",4]
[23212007,"Splendidparkiet grijsblauw man",null,"07",4]
[23212008,"Splendidparkiet grijsblauw pop",null,"07",4]
[23213001,"Splendidparkiet cinnamon groen man",null,"07",4]
[23213002,"Splendidparkiet cinnamon groen pop",null,"07",4]
[23213003,"Splendidparkiet cinnamon grijsgroen man",null,"07",4]
[23213004,"Splendidparkiet cinnamon grijsgroen pop",null,"07",4]
[23213005,"Splendidparkiet cinnamon aqua man",null,"07",4]
[23213006,"Splendidparkiet cinnamon aqua pop",null,"07",4]
[23213007,"Splendidparkiet cinnamon turquoise man",null,"07",4]
[23213008,"Splendidparkiet cinnamon turquoise pop",null,"07",4]
[23214001,"Splendidparkiet cinnamon groen man",null,"07",4]
[23214002,"Splendidparkiet cinnamon groen pop",null,"07",4]
[23214003,"Splendidparkiet cinnamon grijsgroen man",null,"07",4]
[23214004,"Splendidparkiet cinnamon grijsgroen pop",null,"07",4]
[23214005,"Splendidparkiet cinnamon aqua man",null,"07",4]
[23214006,"Splendidparkiet cinnamon aqua pop",null,"07",4]
[23214007,"Splendidparkiet cinnamon turquoise man",null,"07",4]
[23214008,"Splendidparkiet cinnamon turquoise pop",null,"07",4]
[23214009,"Splendidparkiet cinnamon blauw man",null,"07",4]
[23214010,"Splendidparkiet cinnamon blauw pop",null,"07",4]
[23214011,"Splendidparkiet cinnamon grijsblauw man",null,"07",4]
[23214012,"Splendidparkiet cinnamon grijsblauw pop",null,"07",4]
[23214013,"Splendidparkiet cinnamon-ino groen man",null,"07",4]
[23214014,"Splendidparkiet cinnamon-ino groen pop",null,"07",4]
[23215001,"Splendidparkiet pale groen serie man",null,"07",4]
[23215002,"Splendidparkiet pale groen serie pop",null,"07",4]
[23215003,"Splendidparkiet pale aqua serie man",null,"07",4]
[23215004,"Splendidparkiet pale aqua serie pop",null,"07",4]
[23215005,"Splendidparkiet pale turquoise serie man",null,"07",4]
[23215006,"Splendidparkiet pale turquoise serie pop",null,"07",4]
[23215007,"Splendidparkiet pale blauw serie man",null,"07",4]
[23215008,"Splendidparkiet pale blauw serie pop",null,"07",4]
[23215009,"Splendidparkiet pale grijsgroen serie man",null,"07",4]
[23215010,"Splendidparkiet pale grijsgroen serie pop",null,"07",4]
[23215011,"Splendidparkiet pale grijsblauw serie man",null,"07",4]
[23215012,"Splendidparkiet pale grijsblauw serie pop",null,"07",4]
[23216001,"Splendidparkiet SL ino groen man",null,"07",4]
[23216002,"Splendidparkiet SL ino groen pop",null,"07",4]
[23216003,"Splendidparkiet SL ino oranjeborst man",null,"07",4]
[23216004,"Splendidparkiet SL ino aqua man",null,"07",4]
[23216005,"Splendidparkiet SL ino aqua pop",null,"07",4]
[23216006,"Splendidparkiet SL ino turquoise man",null,"07",4]
[23216007,"Splendidparkiet SL ino turquoise pop",null,"07",4]
[23216008,"Splendidparkiet SL ino blauw (albino)",null,"07",4]
[23217001,"Splendidparkiet oranjeborst groen man",null,"07",4]
[23217002,"Splendidparkiet oranjeborst grijsgroen man",null,"07",4]
[23217003,"Splendidparkiet cinnamon oranjeborst groen man",null,"07",4]
[23217004,"Splendidparkiet cinnamon oranjeborst grijsgroen man",null,"07",4]
[23217005,"Splendidparkiet pale oranjeborst groen man",null,"07",4]
[23217006,"Splendidparkiet pale oranjeborst grijsgroen man",null,"07",4]
[23218001,"Splendidparkiet roodbuik groen man",null,"07",4]
[23218002,"Splendidparkiet roodbuik groen pop",null,"07",4]
[23218003,"Splendidparkiet roodbuik violet groen man",null,"07",4]
[23218004,"Splendidparkiet roodbuik violet groen pop",null,"07",4]
[23218005,"Splendidparkiet roodbuik grijsgroen man",null,"07",4]
[23218006,"Splendidparkiet roodbuik grijsgroen pop",null,"07",4]
[23219001,"Splendidparkiet roodbuik opaline groen man",null,"07",4]
[23219002,"Splendidparkiet roodbuik opaline groen pop",null,"07",4]
[23219003,"Splendidparkiet roodbuik opaline violet groen man",null,"07",4]
[23219004,"Splendidparkiet roodbuik opaline violet groen pop",null,"07",4]
[23219005,"Splendidparkiet roodbuik opaline grijsgroen man",null,"07",4]
[23219006,"Splendidparkiet roodbuik opaline grijsgroen pop",null,"07",4]
[23219007,"Splendidparkiet roodbuik opaline aqua man",null,"07",4]
[23219008,"Splendidparkiet roodbuik opaline aqua pop",null,"07",4]
[23219009,"Splendidparkiet roodbuik opaline turquoise man",null,"07",4]
[23219010,"Splendidparkiet roodbuik opaline turquoise pop",null,"07",4]
[23219011,"Splendidparkiet roodbuik opaline pale groen man",null,"07",4]
[23219012,"Splendidparkiet roodbuik opaline pale groen pop",null,"07",4]
[23219013,"Splendidparkiet roodbuik opaline oranjeborst groen man",null,"07",4]
[23219014,"Splendidparkiet roodbuik opaline oranjeborst violet groen man",null,"07",4]
[23219015,"Splendidparkiet roodbuik opaline oranjeborst grijsgroen man",null,"07",4]
[23220001,"Splendidparkiet roodbuik cinnamon groen man",null,"07",4]
[23220002,"Splendidparkiet roodbuik cinnamon groen pop",null,"07",4]
[23220003,"Splendidparkiet roodbuik cinnamon grijsgroen man",null,"07",4]
[23220004,"Splendidparkiet roodbuik cinnamon grijsgroen pop",null,"07",4]
[23220005,"Splendidparkiet roodbuik cinnamon aqua man",null,"07",4]
[23220006,"Splendidparkiet roodbuik cinnamon aqua pop",null,"07",4]
[23220007,"Splendidparkiet roodbuik cinnamon turquoise man",null,"07",4]
[23220008,"Splendidparkiet roodbuik cinnamon turquoise pop",null,"07",4]
[23220009,"Splendidparkiet roodbuik cinnamon-SL ino groen man",null,"07",4]
[23220010,"Splendidparkiet roodbuik cinnamon-SL ino groen pop",null,"07",4]
[23221001,"Splendidparkiet roodbuik pale groen man",null,"07",4]
[23221002,"Splendidparkiet roodbuik pale groen pop",null,"07",4]
[23221003,"Splendidparkiet roodbuik pale grijsgroen man",null,"07",4]
[23221004,"Splendidparkiet roodbuik pale grijsgroen pop",null,"07",4]
[23221005,"Splendidparkiet roodbuik pale aqua man",null,"07",4]
[23221006,"Splendidparkiet roodbuik pale aqua pop",null,"07",4]
[23221007,"Splendidparkiet roodbuik pale turquoise man",null,"07",4]
[23221008,"Splendidparkiet roodbuik pale turquoise pop",null,"07",4]
[23222001,"Splendidparkiet roodbuik SL ino groen man",null,"07",4]
[23222002,"Splendidparkiet roodbuik SL ino groen pop",null,"07",4]
[23222003,"Splendidparkiet roodbuik SL ino oranjeborst groen man",null,"07",4]
[23222004,"Splendidparkiet roodbuik SL ino aqua man",null,"07",4]
[23222005,"Splendidparkiet roodbuik SL ino aqua pop",null,"07",4]
[23222006,"Splendidparkiet roodbuik SL ino turquoise man",null,"07",4]
[23222007,"Splendidparkiet roodbuik SL ino turquoise pop",null,"07",4]
[23223001,"Splendidparkiet bont groen man",null,"07",4]
[23223002,"Splendidparkiet bont groen pop",null,"07",4]
[23223003,"Splendidparkiet bont turquoise man",null,"07",4]
[23223004,"Splendidparkiet bont turquoise pop",null,"07",4]
[23223005,"Splendidparkiet bont blauw man",null,"07",4]
[23223006,"Splendidparkiet bont blauw pop",null,"07",4]
[23223007,"Splendidparkiet roodbuik bont groen man",null,"07",4]
[23223008,"Splendidparkiet roodbuik bont groen pop",null,"07",4]
[23223009,"Splendidparkiet roodbuik bont turquoise man",null,"07",4]
[23223010,"Splendidparkiet roodbuik bont turquoise pop",null,"07",4]
[23224001,"Splendidparkiet opaline groen man",null,"07",4]
[23224002,"Splendidparkiet opaline groen pop",null,"07",4]
[23224003,"Splendidparkiet opaline grijsgroen man",null,"07",4]
[23224004,"Splendidparkiet opaline grijsgroen pop",null,"07",4]
[23224005,"Splendidparkiet opaline aqua man",null,"07",4]
[23224006,"Splendidparkiet opaline aqua pop",null,"07",4]
[23224007,"Splendidparkiet opaline turquoise man",null,"07",4]
[23224008,"Splendidparkiet opaline turquoise pop",null,"07",4]
[23224009,"Splendidparkiet opaline blauw man",null,"07",4]
[23224010,"Splendidparkiet opaline blauw pop",null,"07",4]
[23224011,"Splendidparkiet opaline-cinnamon groen man",null,"07",4]
[23224012,"Splendidparkiet opaline-cinnamon groen pop",null,"07",4]
[23224013,"Splendidparkiet opaline-pale groen man",null,"07",4]
[23224014,"Splendidparkiet opaline-pale groen pop",null,"07",4]
[23224015,"Splendidparkiet opaline violetblauw man",null,"07",4]
[23224016,"Splendidparkiet opaline violetblauw pop",null,"07",4]
[23290900,"Splendidparkiet nieuwe nog niet erkende mut. en comb. m/p",null,"07",4]
[23290999,"Splendidparkiet nieuwe mut. en comb. m/p (in standaard)",null,"07",4]
[23321001,"Turquoisineparkiet groen man",null,"07",4]
[23321002,"Turquoisineparkiet groen pop",null,"07",4]
[23322001,"Turquoisineparkiet D groen man",null,"07",4]
[23322002,"Turquoisineparkiet D groen pop",null,"07",4]
[23322003,"Turquoisineparkiet DD groen man",null,"07",4]
[23322004,"Turquoisineparkiet DD groen pop",null,"07",4]
[23322005,"Turquoisineparkiet violet groen man",null,"07",4]
[23322006,"Turquoisineparkiet violet groen pop",null,"07",4]
[23322007,"Turquoisineparkiet grijsgroen man",null,"07",4]
[23322008,"Turquoisineparkiet grijsgroen pop",null,"07",4]
[23323001,"Turquoisineparkiet cinnamon groen man",null,"07",4]
[23323002,"Turquoisineparkiet cinnamon groen pop",null,"07",4]
[23323003,"Turquoisineparkiet cinnamon D groen man",null,"07",4]
[23323004,"Turquoisineparkiet cinnamon D groen pop",null,"07",4]
[23323005,"Turquoisineparkiet cinnamon DD groen man",null,"07",4]
[23323006,"Turquoisineparkiet cinnamon DD groen pop",null,"07",4]
[23323007,"Turquoisineparkiet cinnamon grijsgroen man",null,"07",4]
[23323008,"Turquoisineparkiet cinnamon grijsgroen pop",null,"07",4]
[23323009,"Turquoisineparkiet cinnamon dilute groen man",null,"07",4]
[23323010,"Turquoisineparkiet cinnamon dilute groen pop",null,"07",4]
[23324001,"Turquoisineparkiet dilute groen man",null,"07",4]
[23324002,"Turquoisineparkiet dilute groen pop",null,"07",4]
[23324003,"Turquoisineparkiet dilute D groen man",null,"07",4]
[23324004,"Turquoisineparkiet dilute D groen pop",null,"07",4]
[23324005,"Turquoisineparkiet dilute DD groen man",null,"07",4]
[23324006,"Turquoisineparkiet dilute DD groen pop",null,"07",4]
[23324007,"Turquoisineparkiet dilute grijsgroen man",null,"07",4]
[23324008,"Turquoisineparkiet dilute grijsgroen pop",null,"07",4]
[23325001,"Turquoisineparkiet opaline groen man",null,"07",4]
[23325002,"Turquoisineparkiet opaline groen pop",null,"07",4]
[23325003,"Turquoisineparkiet opaline D groen man",null,"07",4]
[23325004,"Turquoisineparkiet opaline D groen pop",null,"07",4]
[23325005,"Turquoisineparkiet opaline DD groen man",null,"07",4]
[23325006,"Turquoisineparkiet opaline DD groen pop",null,"07",4]
[23325007,"Turquoisineparkiet opaline grijsgroen man",null,"07",4]
[23325008,"Turquoisineparkiet opaline grijsgroen pop",null,"07",4]
[23325009,"Turquoisineparkiet opaline D grijsgroen man",null,"07",4]
[23325010,"Turquoisineparkiet opaline D grijsgroen pop",null,"07",4]
[23325011,"Turquoisineparkiet opaline DD grijsgroen man",null,"07",4]
[23325012,"Turquoisineparkiet opaline DD grijsgroen pop",null,"07",4]
[23326001,"Turquoisineparkiet opaline cinnamon groen man",null,"07",4]
[23326002,"Turquoisineparkiet opaline cinnamon groen pop",null,"07",4]
[23326003,"Turquoisineparkiet opaline cinnamon D groen man",null,"07",4]
[23326004,"Turquoisineparkiet opaline cinnamon D groen pop",null,"07",4]
[23326005,"Turquoisineparkiet opaline cinnamon DD groen man",null,"07",4]
[23326006,"Turquoisineparkiet opaline cinnamon DD groen pop",null,"07",4]
[23326007,"Turquoisineparkiet opaline cinnamon grijsgroen man",null,"07",4]
[23326008,"Turquoisineparkiet opaline cinnamon grijsgroen pop",null,"07",4]
[23326009,"Turquoisineparkiet opaline cinnamon dilute groen man",null,"07",4]
[23326010,"Turquoisineparkiet opaline cinnamon dilute groen pop",null,"07",4]
[23327001,"Turquoisineparkiet opaline dilute groen man",null,"07",4]
[23327002,"Turquoisineparkiet opaline dilute groen pop",null,"07",4]
[23327003,"Turquoisineparkiet opaline dilute D groen man",null,"07",4]
[23327004,"Turquoisineparkiet opaline dilute D groen pop",null,"07",4]
[23327005,"Turquoisineparkiet opaline dilute DD groen man",null,"07",4]
[23327006,"Turquoisineparkiet opaline dilute DD groen pop",null,"07",4]
[23327007,"Turquoisineparkiet opaline dilute grijsgroen man",null,"07",4]
[23327008,"Turquoisineparkiet opaline dilute grijsgroen pop",null,"07",4]
[23328001,"Turquoisineparkiet roodbuik groen man",null,"07",4]
[23328002,"Turquoisineparkiet roodbuik groen pop",null,"07",4]
[23328003,"Turquoisineparkiet roodbuik D groen man",null,"07",4]
[23328004,"Turquoisineparkiet roodbuik D groen pop",null,"07",4]
[23328005,"Turquoisineparkiet roodbuik DD groen man",null,"07",4]
[23328006,"Turquoisineparkiet roodbuik DD groen pop",null,"07",4]
[23328007,"Turquoisineparkiet roodbuik grijsgroen man",null,"07",4]
[23328008,"Turquoisineparkiet roodbuik grijsgroen pop",null,"07",4]
[23329001,"Turquoisineparkiet roodbuik cinnamon groen man",null,"07",4]
[23329002,"Turquoisineparkiet roodbuik cinnamon groen pop",null,"07",4]
[23329003,"Turquoisineparkiet roodbuik cinnamon D groen man",null,"07",4]
[23329004,"Turquoisineparkiet roodbuik cinnamon D groen pop",null,"07",4]
[23329005,"Turquoisineparkiet roodbuik cinnamon DD groen man",null,"07",4]
[23329006,"Turquoisineparkiet roodbuik cinnamon DD groen pop",null,"07",4]
[23329007,"Turquoisineparkiet roodbuik cinnamon grijsgroen man",null,"07",4]
[23329008,"Turquoisineparkiet roodbuik cinnamon grijsgroen pop",null,"07",4]
[23329009,"Turquoisineparkiet roodbuik cinnamon dilute groen man",null,"07",4]
[23329010,"Turquoisineparkiet roodbuik cinnamon dilute groen pop",null,"07",4]
[23330001,"Turquoisineparkiet roodbuik dilute groen man",null,"07",4]
[23330002,"Turquoisineparkiet roodbuik dilute groen pop",null,"07",4]
[23330003,"Turquoisineparkiet roodbuik dilute D groen man",null,"07",4]
[23330004,"Turquoisineparkiet roodbuik dilute D groen pop",null,"07",4]
[23330005,"Turquoisineparkiet roodbuik dilute DD groen man",null,"07",4]
[23330006,"Turquoisineparkiet roodbuik dilute DD groen pop",null,"07",4]
[23330007,"Turquoisineparkiet roodbuik dilute grijsgroen man",null,"07",4]
[23330008,"Turquoisineparkiet roodbuik dilute grijsgroen pop",null,"07",4]
[23331001,"Turquoisineparkiet roodbuik opaline groen man",null,"07",4]
[23331002,"Turquoisineparkiet roodbuik opaline groen pop",null,"07",4]
[23331003,"Turquoisineparkiet roodbuik opaline D groen man",null,"07",4]
[23331004,"Turquoisineparkiet roodbuik opaline D groen pop",null,"07",4]
[23331005,"Turquoisineparkiet roodbuik opaline DD groen man",null,"07",4]
[23331006,"Turquoisineparkiet roodbuik opaline DD groen pop",null,"07",4]
[23331007,"Turquoisineparkiet roodbuik opaline grijsgroen man",null,"07",4]
[23331008,"Turquoisineparkiet roodbuik opaline grijsgroen pop",null,"07",4]
[23332001,"Turquoisineparkiet roodbuik opaline-cinnamon groen man",null,"07",4]
[23332002,"Turquoisineparkiet roodbuik opaline-cinnamon groen pop",null,"07",4]
[23332003,"Turquoisineparkiet roodbuik opaline-cinnamon D groen man",null,"07",4]
[23332004,"Turquoisineparkiet roodbuik opaline-cinnamon D groen pop",null,"07",4]
[23332005,"Turquoisineparkiet roodbuik opaline-cinnamon DD groen man",null,"07",4]
[23332006,"Turquoisineparkiet roodbuik opaline-cinnamon DD groen pop",null,"07",4]
[23332007,"Turquoisineparkiet roodbuik opaline-cinnamon grijsgroen man",null,"07",4]
[23332008,"Turquoisineparkiet roodbuik opaline-cinnamon grijsgroen pop",null,"07",4]
[23332009,"Turquoisineparkiet roodbuik opaline-cinnamon dilute groen man",null,"07",4]
[23332010,"Turquoisineparkiet roodbuik opaline-cinnamon dilute groen pop",null,"07",4]
[23333001,"Turquoisineparkiet roodbuik opaline dilute groen man",null,"07",4]
[23333002,"Turquoisineparkiet roodbuik opaline dilute groen pop",null,"07",4]
[23333003,"Turquoisineparkiet roodbuik opaline dilute D groen man",null,"07",4]
[23333004,"Turquoisineparkiet roodbuik opaline dilute D groen pop",null,"07",4]
[23333005,"Turquoisineparkiet roodbuik opaline dilute DD groen man",null,"07",4]
[23333006,"Turquoisineparkiet roodbuik opaline dilute DD groen pop",null,"07",4]
[23333007,"Turquoisineparkiet roodbuik opaline dilute grijsgroen man",null,"07",4]
[23333008,"Turquoisineparkiet roodbuik opaline dilute grijsgroen pop",null,"07",4]
[23334001,"Turquoisineparkiet bont groen man",null,"07",4]
[23334002,"Turquoisineparkiet bont groen pop",null,"07",4]
[23334003,"Turquoisineparkiet roodbuik bont groen man",null,"07",4]
[23334004,"Turquoisineparkiet roodbuik bont groen pop",null,"07",4]
[23335001,"Turquoisineparkiet bronze fallow groen man",null,"07",4]
[23335002,"Turquoisineparkiet bronze fallow groen pop",null,"07",4]
[23335003,"Turquoisineparkiet pale fallow groen man",null,"07",4]
[23335004,"Turquoisineparkiet pale fallow groen pop",null,"07",4]
[23390900,"Turquoisineparkiet nieuwe nog niet erkende mut. en comb. m/p",null,"07",4]
[23390999,"Turquoisineparkiet nieuwe mut. en comb. m/p (in standaard)",null,"07",4]
[23400001,"Elegantparkiet groen man",null,"07",4]
[23400002,"Elegantparkiet groen pop",null,"07",4]
[23401001,"Elegantparkiet pastel groen man",null,"07",4]
[23401002,"Elegantparkiet pastel groen pop",null,"07",4]
[23402001,"Elegantparkiet grijsgroen man",null,"07",4]
[23402002,"Elegantparkiet grijsgroen pop",null,"07",4]
[23403001,"Elegantparkiet grijsvleugel groen man",null,"07",4]
[23403002,"Elegantparkiet grijsvleugel groen pop",null,"07",4]
[23404001,"Elegantparkiet bronzefallow groen man",null,"07",4]
[23404002,"Elegantparkiet bronzefallow groen pop",null,"07",4]
[23404003,"Elegantparkiet pale fallow groen man",null,"07",4]
[23404004,"Elegantparkiet pale fallow groen pop",null,"07",4]
[23405001,"Elegantparkiet NSL ino groen man",null,"07",4]
[23405002,"Elegantparkiet NSL ino groen pop",null,"07",4]
[23406001,"Elegantparkiet dominant bont man",null,"07",4]
[23406002,"Elegantparkiet dominant bont pop",null,"07",4]
[23450900,"Elegantparkiet nieuwe nog niet erkende mut. en comb. m/p",null,"07",4]
[23450999,"Elegantparkiet nieuwe mut. en comb. m/p (in standaard)",null,"07",4]
[23460001,"Blauwvleugelparkiet groen man",null,"07",4]
[23460002,"Blauwvleugelparkiet groen pop",null,"07",4]
[23470001,"Blauwvleugelparkiet DF misty groen man",null,"07",4]
[23470002,"Blauwvleugelparkiet DF misty groen pop",null,"07",4]
[23490900,"Blauwvleugelparkiet nieuwe nog niet erkende mut. en comb. m/p",null,"07",4]
[23490999,"Blauwvleugelparkiet nieuwe mut. en comb. m/p (in standaard)",null,"07",4]
[24001001,"Valkparkiet wildkleur man",null,"07",4]
[24001002,"Valkparkiet wildkleur pop",null,"07",4]
[24001004,"Valkparkiet getekend geelwang m/p",null,"07",4]
[24002001,"Valkparkiet bleekmasker man",null,"07",4]
[24002002,"Valkparkiet bleekmasker pop",null,"07",4]
[24002003,"Valkparkiet witmasker (blauw) man",null,"07",4]
[24002004,"Valkparkiet witmasker (blauw) pop",null,"07",4]
[24003001,"Valkparkiet cinnamon man",null,"07",4]
[24003002,"Valkparkiet cinnamon pop",null,"07",4]
[24003005,"Valkparkiet cinnamon witmasker (blauw) man",null,"07",4]
[24003006,"Valkparkiet cinnamon witmasker (blauw) pop",null,"07",4]
[24003007,"Valkparkiet cinnamon-geelwang man",null,"07",4]
[24003008,"Valkparkiet cinnamon-geelwang pop",null,"07",4]
[24004001,"Valkparkiet SL ino man",null,"07",4]
[24004002,"Valkparkiet SL ino pop",null,"07",4]
[24004003,"Valkparkiet SL ino bleekmasker man",null,"07",4]
[24004004,"Valkparkiet SL ino bleekmasker pop",null,"07",4]
[24004005,"Valkparkiet SL ino witmasker (blauw) m/p ",null,"07",4]
[24004006,"Valkparkiet SL ino-geelwang man",null,"07",4]
[24004007,"Valkparkiet SL ino-geelwang pop",null,"07",4]
[24005001,"Valkparkiet EF dominant gezoomd man",null,"07",4]
[24005002,"Valkparkiet EF dominant gezoomd pop",null,"07",4]
[24005003,"Valkparkiet EF dominant gezoomd bleekmasker man",null,"07",4]
[24005004,"Valkparkiet EF dominant gezoomd bleekmasker pop",null,"07",4]
[24005005,"Valkparkiet EF dominant gezoomd witmasker (blauw) man",null,"07",4]
[24005006,"Valkparkiet EF dominant gezoomd witmasker (blauw) pop",null,"07",4]
[24005007,"Valkparkiet EF dominant gezoomd geelwang man",null,"07",4]
[24005008,"Valkparkiet EF dominant gezoomd geelwang pop",null,"07",4]
[24005009,"Valkparkiet DF dominant gezoomd man",null,"07",4]
[24005010,"Valkparkiet DF dominant gezoomd pop",null,"07",4]
[24005011,"Valkparkiet DF dominant gezoomd bleekmasker man",null,"07",4]
[24005012,"Valkparkiet DF dominant gezoomd bleekmasker pop",null,"07",4]
[24005013,"Valkparkiet DF dominant gezoomd witmasker (blauw) man",null,"07",4]
[24005014,"Valkparkiet DF dominant gezoomd witmasker (blauw) pop",null,"07",4]
[24005015,"Valkparkiet DF dominant gezoomd geelwang man",null,"07",4]
[24005016,"Valkparkiet DF dominant gezoomd geelwang pop",null,"07",4]
[24006001,"Valkparkiet bronze fallow man",null,"07",4]
[24006002,"Valkparkiet bronze fallow pop",null,"07",4]
[24006003,"Valkparkiet bronze fallow bleekmasker man",null,"07",4]
[24006004,"Valkparkiet bronze fallow bleekmasker pop",null,"07",4]
[24006005,"Valkparkiet bronze fallow witmasker (blauw) man",null,"07",4]
[24006006,"Valkparkiet bronze fallow witmasker (blauw) pop",null,"07",4]
[24006007,"Valkparkiet dun fallow man",null,"07",4]
[24006008,"Valkparkiet dun fallow pop",null,"07",4]
[24006009,"Valkparkiet dun fallow bleekmasker man",null,"07",4]
[24006010,"Valkparkiet dun fallow bleekmasker pop",null,"07",4]
[24006011,"Valkparkiet dun fallow witmasker (blauw) man",null,"07",4]
[24006012,"Valkparkiet dun fallow witmasker (blauw) pop",null,"07",4]
[24008001,"Valkparkiet geelwang man",null,"07",4]
[24008002,"Valkparkiet geelwang pop",null,"07",4]
[24008003,"Valkparkiet bronze fallow geelwang man",null,"07",4]
[24008004,"Valkparkiet bronze fallow geelwang pop",null,"07",4]
[24008005,"Valkparkiet dun fallow geelwang man",null,"07",4]
[24008006,"Valkparkiet dun fallow geelwang pop",null,"07",4]
[24008007,"Valkparkiet geelmasker man",null,"07",4]
[24008008,"Valkparkiet geelmasker pop",null,"07",4]
[24009001,"Valkparkiet opaline",null,"07",4]
[24009002,"Valkparkiet opaline bleekmasker",null,"07",4]
[24009003,"Valkparkiet opaline witmasker (blauw)",null,"07",4]
[24009004,"Valkparkiet opaline-cinnamon",null,"07",4]
[24009005,"Valkparkiet opaline-geelwang",null,"07",4]
[24009006,"Valkparkiet opaline-cinnamon bleekmasker",null,"07",4]
[24009007,"Valkparkiet opaline-cinnamon witmasker (blauw)",null,"07",4]
[24009008,"Valkparkiet opaline-cinnamon geelwang",null,"07",4]
[24009009,"Valkparkiet opaline-ino",null,"07",4]
[24009010,"Valkparkiet opaline-ino-geelwang",null,"07",4]
[24009011,"Valkparkiet opaline bronze fallow",null,"07",4]
[24009012,"Valkparkiet opaline bronze fallow bleekmasker",null,"07",4]
[24009013,"Valkparkiet opaline bronze fallow witmasker",null,"07",4]
[24009014,"Valkparkiet opaline dun fallow",null,"07",4]
[24009015,"Valkparkiet opaline dun fallow bleekmasker",null,"07",4]
[24009016,"Valkparkiet opaline dun fallow witmasker",null,"07",4]
[24010001,"Valkparkiet recessief bont m/p",null,"07",4]
[24010002,"Valkparkiet recessief bont bleekmasker man",null,"07",4]
[24010003,"Valkparkiet recessief bont witmasker man",null,"07",4]
[24010004,"Valkparkiet recessief bont geelwang m/p",null,"07",4]
[24011001,"Valkparkiet getekend wildkleur m/p",null,"07",4]
[24011002,"Valkparkiet getekend bleekmasker m/p",null,"07",4]
[24011003,"Valkparkiet getekend witmasker m/p",null,"07",4]
[24190900,"Valkparkiet nieuwe nog niet erkende mut. en comb. m/p",null,"07",4]
[24190999,"Valkparkiet nieuwe mut. en comb. m/p (in standaard)",null,"07",4]
[25001001,"Red vented blue bonnet man",null,"07",4]
[25001002,"Red vented blue bonnet pop",null,"07",4]
[25001003,"Yellow vented blue bonnet man",null,"07",4]
[25001004,"Yellow vented blue bonnet pop",null,"07",4]
[25002900,"Red- en Yellow vented blue bonnet nieuwe nog niet erkende mut. en comb.",null,"07",4]
[25002999,"Red-en Yellow vented blue bonnet nieuwe  erkende mut. en comb. (in standaard)",null,"07",4]
[25003001,"Hooded parkiet groen man",null,"07",4]
[25003002,"Hooded parkiet groen pop",null,"07",4]
[25003003,"Goudschouder parkiet groen man",null,"07",4]
[25003004,"Goudschouder parkiet groen pop",null,"07",4]
[25004900,"Goudschouder- en hoodedparkiet nieuwe nog niet erkende mut. en comb. m/p",null,"07",4]
[25004999,"Goudschouder- en hoodedparkiet nieuwe mut. en comb. m/p (in standaard)",null,"07",4]
[25005001,"Veelkleurenparkiet groen man",null,"07",4]
[25005002,"Veelkleurenparkiet groen pop",null,"07",4]
[25006001,"Veelkleurenparkiet grijsgroen man",null,"07",4]
[25006002,"Veelkleurenparkiet grijsgroen pop",null,"07",4]
[25006003,"Veelkleurenparkiet roodbuik groen man",null,"07",4]
[25006004,"Veelkleurenparkiet roodbuik groen pop",null,"07",4]
[25006005,"Veelkleurenparkiet roodbuik grijsgroen man",null,"07",4]
[25006006,"Veelkleurenparkiet roodbuik grijsgroen pop",null,"07",4]
[25006900,"Veelkleurenparkiet nieuwe nog niet erkende mut. en comb. m/p",null,"07",4]
[25006999,"Veelkleurenparkiet nieuwe mut. en comb. m/p (in standaard)",null,"07",4]
[25007001,"Roodstuitparkiet groen man",null,"07",4]
[25007002,"Roodstuitparkiet groen pop",null,"07",4]
[25008001,"Roodstuitparkiet grijsgroen man",null,"07",4]
[25008002,"Roodstuitparkiet grijsgroen pop",null,"07",4]
[25008003,"Roodstuitparkiet aqua man",null,"07",4]
[25008004,"Roodstuitparkiet aqua pop",null,"07",4]
[25008005,"Roodstuitparkiet blauw man",null,"07",4]
[25008006,"Roodstuitparkiet blauw pop",null,"07",4]
[25008007,"Roodstuitparkiet grijsblauw man",null,"07",4]
[25008008,"Roodstuitparkiet grijsblauw pop",null,"07",4]
[25009001,"Roodstuitparkiet cinnamon groen man",null,"07",4]
[25009002,"Roodstuitparkiet cinnamon groen pop",null,"07",4]
[25009003,"Roodstuitparkiet cinnamon grijsgroen man",null,"07",4]
[25009004,"Roodstuitparkiet cinnamon grijsgroen pop",null,"07",4]
[25009005,"Roodstuitparkiet cinnamon aqua man",null,"07",4]
[25009006,"Roodstuitparkiet cinnamon aqua pop",null,"07",4]
[25009007,"Roodstuitparkiet cinnamon blauw man",null,"07",4]
[25009008,"Roodstuitparkiet cinnamon blauw pop",null,"07",4]
[25010001,"Roodstuitparkiet pallid groen man",null,"07",4]
[25010002,"Roodstuitparkiet pallid groen pop",null,"07",4]
[25010003,"Roodstuitparkiet pallid aqua man",null,"07",4]
[25010004,"Roodstuitparkiet pallid aqua pop",null,"07",4]
[25010005,"Roodstuitparkiet pallid blauw man",null,"07",4]
[25010006,"Roodstuitparkiet pallid blauw pop",null,"07",4]
[25011001,"Roodstuitparkiet SL ino groen man",null,"07",4]
[25011002,"Roodstuitparkiet SL ino groen pop",null,"07",4]
[25011003,"Roodstuitparkiet SL ino aqua man",null,"07",4]
[25011004,"Roodstuitparkiet SL ino aqua pop",null,"07",4]
[25011005,"Roodstuitparkiet SL ino blauw man",null,"07",4]
[25011006,"Roodstuitparkiet SL ino blauw pop",null,"07",4]
[25012001,"Roodstuitparkiet opaline groen man",null,"07",4]
[25012002,"Roodstuitparkiet opaline groen pop",null,"07",4]
[25012003,"Roodstuitparkiet opaline grijsgroen man",null,"07",4]
[25012004,"Roodstuitparkiet opaline grijsgroen pop",null,"07",4]
[25012005,"Roodstuitparkiet opaline aqua man",null,"07",4]
[25012006,"Roodstuitparkiet opaline aqua pop",null,"07",4]
[25012007,"Roodstuitparkiet opaline blauw man",null,"07",4]
[25012008,"Roodstuitparkiet opaline blauw pop",null,"07",4]
[25012009,"Roodstuitparkiet opaline grijsblauw man",null,"07",4]
[25012010,"Roodstuitparkiet opaline grijsblauw pop",null,"07",4]
[25012011,"Roodstuitparkiet opaline rood man",null,"07",4]
[25012012,"Roodstuitparkiet opaline rood pop",null,"07",4]
[25012013,"Roodstuitparkiet opaline oranje man",null,"07",4]
[25012014,"Roodstuitparkiet opaline oranje pop",null,"07",4]
[25013001,"Roodstuitparkiet opaline-cinnamon groen man",null,"07",4]
[25013002,"Roodstuitparkiet opaline-cinnamon groen pop",null,"07",4]
[25013003,"Roodstuitparkiet opaline-cinnamon rood man",null,"07",4]
[25013004,"Roodstuitparkiet opaline-cinnamon rood pop",null,"07",4]
[25014001,"Roodstuitparkiet opaline-pallid groen man",null,"07",4]
[25014002,"Roodstuitparkiet opaline-pallid groen pop",null,"07",4]
[25015001,"Roodstuitparkiet opaline-ino groen man",null,"07",4]
[25015002,"Roodstuitparkiet opaline-ino groen pop",null,"07",4]
[25015003,"Roodstuitparkiet opaline-ino rood man",null,"07",4]
[25015004,"Roodstuitparkiet opaline-ino rood pop",null,"07",4]
[25016001,"Roodstuitparkiet oranje groen man",null,"07",4]
[25016002,"Roodstuitparkiet oranje groen pop",null,"07",4]
[25017001,"Roodstuitparkiet dominant bont serie (inclusief opaline)",null,"07",4]
[25017002,"Roodstuitparkiet recessief bont serie (inclusief opaline)",null,"07",4]
[25190900,"Roodstuitparkiet nieuwe nog niet erkende mut. en comb.",null,"07",4]
[25190999,"Roodstuitparkiet nieuwe mut. en comb. (in standaard)",null,"07",4]
[26001001,"Swiftparkiet groen",null,"07",4]
[26002001,"Swiftparkiet roodbuik groen",null,"07",4]
[26002002,"Swiftparkiet faded groen",null,"07",4]
[26002003,"Swiftparkiet DF misty groen",null,"07",4]
[26190900,"Swiftparkiet nieuwe nog niet erkende mut. en comb.",null,"07",4]
[26190999,"Swiftparkiet nieuwe mut. en comb. (in standaard)",null,"07",4]
[26200001,"Roodvoorhoofd kakariki groen",null,"07",4]
[26202001,"Roodvoorhoofd kakariki aqua",null,"07",4]
[26202002,"Roodvoorhoofd kakariki turquoise",null,"07",4]
[26203001,"Roodvoorhoofd kakariki cinnamon groen",null,"07",4]
[26203002,"Roodvoorhoofd kakariki cinnamon aqua",null,"07",4]
[26203003,"Roodvoorhoofd kakariki cinnamon turquoise",null,"07",4]
[26204001,"Roodvoorhoofd kakariki fallow groen",null,"07",4]
[26204002,"Roodvoorhoofd kakariki fallow aqua",null,"07",4]
[26204003,"Roodvoorhoofd kakariki fallow turquoise",null,"07",4]
[26205001,"Roodvoorhoofd kakariki gezoomd groen",null,"07",4]
[26205002,"Roodvoorhoofd kakariki gezoomd aqua",null,"07",4]
[26205003,"Roodvoorhoofd kakariki gezoomd turquoise",null,"07",4]
[26208001,"Roodvoorhoofd kakariki recessief bont groen",null,"07",4]
[26208002,"Roodvoorhoofd kakariki recessief bont aqua",null,"07",4]
[26208003,"Roodvoorhoofd kakariki recessief bont turquoise",null,"07",4]
[26208004,"Roodvoorhoofd kakariki dominant bont groen",null,"07",4]
[26208005,"Roodvoorhoofd kakariki dominant bont aqua",null,"07",4]
[26208006,"Roodvoorhoofd kakariki dominant bont turquoise",null,"07",4]
[26208007,"Roodvoorhoofd kakariki DEC groen",null,"07",4]
[26208008,"Roodvoorhoofd kakariki DEC aqua",null,"07",4]
[26208009,"Roodvoorhoofd kakariki DEC turquoise",null,"07",4]
[26210001,"Roodvoorhoofd kakariki SL ino groen",null,"07",4]
[26210002,"Roodvoorhoofd kakariki SL ino aqua",null,"07",4]
[26210003,"Roodvoorhoofd kakariki SL ino turquoise",null,"07",4]
[26290900,"Roodvoorhoofd kakariki nieuwe nog niet erkende mut. en comb.",null,"07",4]
[26290999,"Roodvoorhoofd kakariki nieuwe mut. en comb. (in standaard)",null,"07",4]
[26300001,"Geelvoorhoofd kakariki groen",null,"07",4]
[26302001,"Geelvoorhoofd kakariki aqua",null,"07",4]
[26302002,"Geelvoorhoofd kakariki turquoise",null,"07",4]
[26304001,"Geelvoorhoofd kakariki cinnamon groen",null,"07",4]
[26304002,"Geelvoorhoofd kakariki cinnamon aqua",null,"07",4]
[26304003,"Geelvoorhoofd kakariki cinnamon turquiose",null,"07",4]
[26305001,"Geelvoorhoofd kakariki fallow groen",null,"07",4]
[26305002,"Geelvoorhoofd kakariki fallow aqua",null,"07",4]
[26305003,"Geelvoorhoofd kakariki fallow turquoise",null,"07",4]
[26306001,"Geelvoorhoofd kakariki gezoomd groen",null,"07",4]
[26306002,"Geelvoorhoofd kakariki gezoomd aqua",null,"07",4]
[26306003,"Geelvoorhoofd kakariki gezoomd turquoise",null,"07",4]
[26307001,"Geelvoorhoofd kakariki recessief bont groen",null,"07",4]
[26307002,"Geelvoorhoofd kakariki recessief bont aqua",null,"07",4]
[26307003,"Geelvoorhoofd kakariki recessief bont turquoise",null,"07",4]
[26307004,"Geelvoorhoofd kakariki dominant bont groen",null,"07",4]
[26307005,"Geelvoorhoofd kakariki dominant bont aqua",null,"07",4]
[26307006,"Geelvoorhoofd kakariki dominant bont turquoise",null,"07",4]
[26307007,"Geelvoorhoofd kakariki DEC groen",null,"07",4]
[26307008,"Geelvoorhoofd kakariki DEC aqua",null,"07",4]
[26307009,"Geelvoorhoofd kakariki DEC turquoise",null,"07",4]
[26308001,"Geelvoorhoofd kakariki SL ino groen",null,"07",4]
[26308002,"Geelvoorhoofd kakariki SL ino aqua",null,"07",4]
[26308003,"Geelvoorhoofd kakariki SL ino turquoise",null,"07",4]
[26390900,"Geelvoorhoofd kakariki nieuwe nog niet erkende mut. en comb.",null,"07",4]
[26390999,"Geelvoorhoofd kakariki nieuwe mut. en comb. (in standaard)",null,"07",4]
[27001001,"Prachtrosella wildkleur",null,"09",5]
[27001002,"Prachtrosella goudmantel wildkleur",null,"09",5]
[27002001,"Prachtrosella cinnamon",null,"09",5]
[27002002,"Prachtrosella pastel",null,"09",5]
[27002003,"Prachtrosella blauw",null,"09",5]
[27002004,"Prachtrosella dilute",null,"09",5]
[27002007,"Prachtrosella opaline",null,"09",5]
[27002008,"Prachtrosella opaline-cinnamon",null,"09",5]
[27002009,"Prachtrosella opaline pastel",null,"09",5]
[27002010,"Prachtrosella opaline-ino",null,"09",5]
[27002011,"Prachtrosella SL ino",null,"09",5]
[27002014,"Prachtrosella dominant bont",null,"09",5]
[27002900,"Prachtrosella nieuwe nog niet erkende mut. en comb. m/p",null,"09",5]
[27002999,"Prachtrosella nieuwe mut. en comb. m/p (in standaard)",null,"09",5]
[27003001,"Pennantrosella wildkleur",null,"09",5]
[27004001,"Pennantrosella aqua",null,"09",5]
[27004002,"Pennantrosella turquoise",null,"09",5]
[27004003,"Pennantrosella blauw",null,"09",5]
[27004004,"Pennantrosella cinnamon",null,"09",5]
[27004005,"Pennantrosella cinnamon aqua",null,"09",5]
[27004006,"Pennantrosella cinnamon turquoise",null,"09",5]
[27004007,"Pennantrosella cinnamon blauw",null,"09",5]
[27004008,"Pennantrosella pastel",null,"09",5]
[27004009,"Pennantrosella pastel aqua",null,"09",5]
[27004010,"Pennantrosella pastel turquoise",null,"09",5]
[27004011,"Pennantrosella pastel blauw",null,"09",5]
[27004012,"Pennantrosella bronze fallow",null,"09",5]
[27004013,"Pennantrosella bronze fallow aqua",null,"09",5]
[27004014,"Pennantrosella bronze fallow turquoise",null,"09",5]
[27004016,"Pennantrosella SL ino groen",null,"09",5]
[27004017,"Pennantrosella SL ino aqua",null,"09",5]
[27004018,"Pennantrosella SL ino turquoise",null,"09",5]
[27004020,"Pennantrosella SL ino blauw",null,"09",5]
[27004900,"Pennantrosella nieuwe nog niet erkende mut. en comb. m/p",null,"09",5]
[27004999,"Pennantrosella nieuwe mut. en comb. m/p (in standaard)",null,"09",5]
[27005001,"Stanleyrosella groen man",null,"09",5]
[27005002,"Stanleyrosella groen pop",null,"09",5]
[27005003,"Stanleyrosella groen omzoming rood man",null,"09",5]
[27005004,"Stanleyrosella groen omzoming rood pop",null,"09",5]
[27006001,"Stanleyrosella turquoise man",null,"09",5]
[27006002,"Stanleyrosella turquoise pop",null,"09",5]
[27006003,"Stanleyrosella blauw man",null,"09",5]
[27006004,"Stanleyrosella blauw pop",null,"09",5]
[27006005,"Stanleyrosella cinnamon groen man",null,"09",5]
[27006006,"Stanleyrosella cinnamon groen pop",null,"09",5]
[27006009,"Stanleyrosella pastel groen man",null,"09",5]
[27006010,"Stanleyrosella pastel groen pop",null,"09",5]
[27006011,"Stanleyrosella pastel blauw man",null,"09",5]
[27006012,"Stanleyrosella pastel blauw pop",null,"09",5]
[27006013,"Stanleyrosella bronze fallow man",null,"09",5]
[27006014,"Stanleyrosella bronze fallow pop",null,"09",5]
[27006015,"Stanleyrosella opaline man",null,"09",5]
[27006016,"Stanleyrosella opaline pop",null,"09",5]
[27006021,"Stanleyrosella opaline cinnamon man",null,"09",5]
[27006022,"Stanleyrosella opaline cinnamon pop",null,"09",5]
[27006023,"Stanleyrosella SL ino groen man",null,"09",5]
[27006024,"Stanleyrosella SL ino groen pop",null,"09",5]
[27006900,"Stanleyrosella nieuwe nog niet erkende mut. en comb. m/p",null,"09",5]
[27006999,"Stanleyrosella nieuwe mut. en comb. m/p (in standaard)",null,"09",5]
[27007001,"Adelaiderosella wildkleur",null,"09",5]
[27008900,"Adelaiderosella nieuwe nog niet erkende mut. en comb. m/p",null,"09",5]
[27008999,"Adelaiderosella nieuwe mut. en comb. m/p (in standaard)",null,"09",5]
[27009001,"Blauwwangrosella wildkleur",null,"09",5]
[27009002,"Brownrosella wildkleur",null,"09",5]
[27010001,"Bleekkoprosella wildkleur",null,"09",5]
[27011001,"Bleekkoprosella cinnamon",null,"09",5]
[27011002,"Bleekkoprosella pastel",null,"09",5]
[27011003,"Bleekkoprosella blauw",null,"09",5]
[27011006,"Bleekkoprosella SL ino groen",null,"09",5]
[27011008,"Bleekkoprosella dominant bont",null,"09",5]
[27011900,"Bleekkoprosella nieuwe nog niet erkende mut. en comb. m/p",null,"09",5]
[27011999,"Bleekkoprosella nieuwe mut. en comb. m/p (in standaard)",null,"09",5]
[27012001,"Geelbuikrosella groen",null,"09",5]
[27013002,"Geelbuikrosella cinnamon",null,"09",5]
[27013003,"Geelbuikrosella dominant bont",null,"09",5]
[27013900,"Geelbuikrosella nieuwe nog niet erkende mut. en comb. m/p",null,"09",5]
[27013999,"Geelbuikrosella nieuwe mut. en comb. m/p (in standaard)",null,"09",5]
[27014001,"Strogele rosella groen",null,"09",5]
[27015001,"Strogele rosella SL ino groen",null,"09",5]
[27015002,"Strogele rosella dominant bont",null,"09",5]
[27015003,"Strogele rosella dilute groen",null,"09",5]
[27015900,"Strogele rosella nieuwe nog niet erkende mut. en comb. m/p",null,"09",5]
[27015999,"Strogele rosella nieuwe mut. en comb. m/p (in standaard)",null,"09",5]
[27016001,"Barnardparkiet groen man",null,"09",5]
[27016002,"Barnardparkiet groen pop",null,"09",5]
[27017001,"Barnardparkiet blauw man",null,"09",5]
[27017002,"Barnardparkiet blauw pop",null,"09",5]
[27017900,"Barnardparkiet nieuwe nog niet erkende mut. en comb. m/p",null,"09",5]
[27017999,"Barnardparkiet nieuwe mut. en comb. m/p (in standaard)",null,"09",5]
[27018001,"Cloncurryparkiet groen man",null,"09",5]
[27018002,"Cloncurryparkiet groen pop",null,"09",5]
[27019900,"Cloncurryparkiet nieuwe nog niet erkende mut. en comb. m/p",null,"09",5]
[27019999,"Cloncurryparkiet  nieuwe mut. en comb. m/p (in standaard)",null,"09",5]
[27020001,"Port Lincolnparkiet groen man",null,"09",5]
[27020002,"Port Lincolnparkiet groen pop",null,"09",5]
[27021001,"Port Lincolnparkiet blauw man",null,"09",5]
[27021002,"Port Lincolnparkiet blauw pop",null,"09",5]
[27021900,"Port Lincolnparkiet nieuwe nog niet erkende mut. en comb. m/p",null,"09",5]
[27021999,"Port Lincolnparkiet nieuwe mut. en comb. m/p (in standaard)",null,"09",5]
[27022001,"Twenty eightparkiet groen man",null,"09",5]
[27022002,"Twenty eightparkiet groen pop",null,"09",5]
[27023001,"Twenty eightparkiet blauw man",null,"09",5]
[27023002,"Twenty eightparkiet blauw pop",null,"09",5]
[27023900,"Twenty eightparkiet nieuwe nog niet erkende mut. en comb. m/p",null,"09",5]
[27023999,"Twenty eightparkiet nieuwe mut. en comb. m/p (in standaard)",null,"09",5]
[27024001,"Barrabandparkiet groen man",null,"09",5]
[27024002,"Barrabandparkiet groen pop",null,"09",5]
[27025001,"Barrabandparkiet pastel man",null,"09",5]
[27025002,"Barrabandparkiet pastel pop",null,"09",5]
[27025003,"Barrabandparkiet cinnamon man",null,"09",5]
[27025004,"Barrabandparkiet cinnamon pop",null,"09",5]
[27025005,"Barrabandparkiet grijsgroen man",null,"09",5]
[27025006,"Barrabandparkiet grijsgroen pop",null,"09",5]
[27025900,"Barrabandparkiet nieuwe nog niet erkende mut. en comb. m/p",null,"09",5]
[27025999,"Barrabandparkiet nieuwe mut. en comb. m/p (in standaard)",null,"09",5]
[27026001,"Bergparkiet groen man",null,"09",5]
[27026002,"Bergparkiet groen pop",null,"09",5]
[27027001,"Bergparkiet pastel man",null,"09",5]
[27027002,"Bergparkiet pastel pop",null,"09",5]
[27027003,"Bergparkiet dilute turquoise man",null,"09",5]
[27027004,"Bergparkiet dilute turquoise pop",null,"09",5]
[27027005,"Bergparkiet EF gezoomd groen man",null,"09",5]
[27027006,"Bergparkiet EF gezoomd groen pop",null,"09",5]
[27027007,"Bergparkiet DEC groen man",null,"09",5]
[27027008,"Bergparkiet DEC groen pop",null,"09",5]
[27027900,"Bergparkiet nieuwe nog niet erkende mut. en comb. m/p",null,"09",5]
[27027999,"Bergparkiet nieuwe mut. en comb. m/p (in standaard)",null,"09",5]
[27028001,"Prinses van Wales parkiet groen man",null,"09",5]
[27028002,"Prinses van Wales parkiet groen pop",null,"09",5]
[27029001,"Prinses van Wales parkiet blauw man",null,"09",5]
[27029002,"Prinses van Wales parkiet blauw pop",null,"09",5]
[27029003,"Prinses van Wales parkiet NSL ino groen man",null,"09",5]
[27029004,"Prinses van Wales parkiet NSL ino groen pop",null,"09",5]
[27029005,"Prinses van Wales parkiet NSL ino blauw man",null,"09",5]
[27029006,"Prinses van Wales parkiet NSL ino blauw pop",null,"09",5]
[27029900,"Prinses van Wales parkiet nieuwe nog niet erkende mut. en comb. m/p",null,"09",5]
[27029999,"Prinses van Wales parkiet nieuwe mut. en comb. m/p (in standaard)",null,"09",5]
[27030001,"Hoornparkiet groen",null,10,5]
[27030002,"Roodkapparkiet groen m/p",null,"09",5]
[27030100,"Australische parkieten niet genoemde soorten groen",null,"09",5]
[27031900,"Australische parkieten nieuwe nog niet erkende mut. en comb. m/p",null,"09",5]
[27031999,"Australische parkieten nieuwe mut. en comb. m/p (in standaard)",null,"09",5]
[27032001,"Roodvleugelparkiet groen man",null,"09",5]
[27032002,"Roodvleugelparkiet groen pop",null,"09",5]
[27032003,"Timor roodvleugelparkiet groen man",null,"09",5]
[27032004,"Timor roodvleugelparkiet groen pop",null,"09",5]
[27033900,"Roodvleugelparkiet nieuwe nog niet erkende mut. en comb. m/p",null,"09",5]
[27033999,"Roodvleugelparkiet nieuwe mut. en comb. m/p (in standaard)",null,"09",5]
[27034001,"Australische koningsparkiet groen man",null,"09",5]
[27034002,"Australische koningsparkiet groen pop",null,"09",5]
[27035001,"Australische koningsparkiet dilute groen man",null,"09",5]
[27035002,"Australische koningsparkiet dilute groen pop",null,"09",5]
[27036900,"Australische koningsparkiet nieuwe nog niet erkende mut. en comb. m/p",null,"09",5]
[27036999,"Australische koningsparkiet nieuwe mut. en comb. m/p (in standaard)",null,"09",5]
[27037001,"Ambon koningsparkiet groen man",null,"09",5]
[27037002,"Ambon koningsparkiet groen pop",null,"09",5]
[27038900,"Ambon koningsparkiet nieuwe nog niet erkende mut. en comb. m/p",null,"09",5]
[27038999,"Ambon koningsparkiet nieuwe mut. en comb. m/p (in standaard)",null,"09",5]
[27039001,"Groenvleugel koningsparkiet groen man",null,"09",5]
[27039002,"Groenvleugel koningsparkiet groen pop",null,"09",5]
[27040900,"Groenvleugel koningsparkiet nieuwe nog niet erkende mut. en comb. m/p",null,"09",5]
[27040999,"Groenvleugel koningsparkiet nieuwe mut. en comb. m/p (in standaard)",null,"09",5]
[27100999,"Koningsparkiet niet genoemde soorten groen m/p",null,"09",5]
[28001001,"Halsbandparkiet groen man",null,"09",5]
[28001002,"Halsbandparkiet groen pop",null,"09",5]
[28002001,"Halsbandparkiet D groen man",null,"09",5]
[28002002,"Halsbandparkiet D groen pop",null,"09",5]
[28002003,"Halsbandparkiet DD groen man",null,"09",5]
[28002004,"Halsbandparkiet DD groen pop",null,"09",5]
[28003001,"Halsbandparkiet grijsgroen man",null,"09",5]
[28003002,"Halsbandparkiet grijsgroen pop",null,"09",5]
[28003003,"Halsbandparkiet grijsblauw man",null,"09",5]
[28003004,"Halsbandparkiet grijsblauw pop",null,"09",5]
[28003005,"Halsbandparkiet grijs turquoise man",null,"09",5]
[28003006,"Halsbandparkiet grijs turquoise pop",null,"09",5]
[28004007,"Halsbandparkiet turquoise man",null,"09",5]
[28004008,"Halsbandparkiet turquoise pop",null,"09",5]
[28004900,"Halsbandparkiet niet genoemde turquoise comb.  kleurslagen",null,"09",5]
[28004999,"Halsbandparkiet nieuwe turquoise muatie comb. (in standaard)",null,"09",5]
[28005001,"Halsbandparkiet blauw man",null,"09",5]
[28005002,"Halsbandparkiet blauw pop",null,"09",5]
[28005003,"Halsbandparkiet D blauw man",null,"09",5]
[28005004,"Halsbandparkiet D blauw pop",null,"09",5]
[28005005,"Halsbandparkiet DD blauw man",null,"09",5]
[28005006,"Halsbandparkiet DD blauw pop",null,"09",5]
[28005007,"Halsbandparkiet violetblauw man",null,"09",5]
[28005008,"Halsbandparkiet violetblauw pop",null,"09",5]
[28006001,"Halsbandparkiet cinnamon groen man",null,"09",5]
[28006002,"Halsbandparkiet cinnamon groen pop",null,"09",5]
[28006007,"Halsbandparkiet cinnamon grijsgroen man",null,"09",5]
[28006008,"Halsbandparkiet cinnamon grijsgroen pop",null,"09",5]
[28006009,"Halsbandparkiet cinnamon turquoise man",null,"09",5]
[28006010,"Halsbandparkiet cinnamon turquoise pop",null,"09",5]
[28006011,"Halsbandparkiet cinnamon blauw man",null,"09",5]
[28006012,"Halsbandparkiet cinnamon blauw pop",null,"09",5]
[28006017,"Halsbandparkiet cinnamon grijs turquoise man",null,"09",5]
[28006018,"Halsbandparkiet cinnamon grijs turquoise pop",null,"09",5]
[28006019,"Halsbandparkiet cinnamon grijsblauw man",null,"09",5]
[28006020,"Halsbandparkiet cinnamon grijsblauw pop",null,"09",5]
[28006900,"Halsbandparkiet niet genoemde cinnamon comb.  kleurslagen",null,"09",5]
[28006999,"Halsbandparkiet nieuwe cinnamon mut. comb. ( in standaard )",null,"09",5]
[28007001,"Halsbandparkiet DF misty groen man",null,"09",5]
[28007002,"Halsbandparkiet DF misty groen pop",null,"09",5]
[28008001,"Halsbandparkiet opaline groen man",null,"09",5]
[28008002,"Halsbandparkiet opaline groen pop",null,"09",5]
[28008900,"Halsbandparkiet niet genoemde opaline comb.  kleurslagen",null,"09",5]
[28008999,"Halsbandparkiet nieuwe opaline mut. comb. ( in standaard )",null,"09",5]
[28009001,"Halsbandparkiet recessief bont serie man",null,"09",5]
[28009002,"Halsbandparkiet recessief bont serie pop",null,"09",5]
[28009900,"Halsbandparkiet niet genoemde bont kleurslagen",null,"09",5]
[28010001,"Halsbandparkiet bronze fallow groen man",null,"09",5]
[28010002,"Halsbandparkiet bronze fallow groen pop",null,"09",5]
[28010900,"Halsbandparkiet niet genoemde bronze fallow comb.  kleurslagen",null,"09",5]
[28010999,"Halsbandparkiet nieuwe bronze fallow mut. comb. (in standaard)",null,"09",5]
[28011001,"Halsbandparkiet bleekkop fallow groen man",null,"09",5]
[28011002,"Halsbandparkiet bleekkop fallow groen pop",null,"09",5]
[28011003,"Halsbandparkiet bleekkop fallow grijsgroen man",null,"09",5]
[28011004,"Halsbandparkiet bleekkop fallow grijsgroen pop",null,"09",5]
[28011005,"Halsbandparkiet bleekkop fallow turquoise man",null,"09",5]
[28011006,"Halsbandparkiet bleekkop fallow turquoise pop",null,"09",5]
[28011007,"Halsbandparkiet bleekkop fallow grijs turquoise man ",null,"09",5]
[28011008,"Halsbandparkiet bleekkop fallow grijs turquoise pop",null,"09",5]
[28011009,"Halsbandparkiet bleekkop fallow blauw man",null,"09",5]
[28011010,"Halsbandparkiet bleekkop fallow blauw pop",null,"09",5]
[28011011,"Halsbandparkiet bleekkop fallow grijsblauw man",null,"09",5]
[28011012,"Halsbandparkiet bleekkop fallow grijsblauw pop",null,"09",5]
[28011900,"Halsbandparkiet niet genoemde bleekkop fallow comb.  kleurslagen",null,"09",5]
[28011999,"Halsbandparkiet nieuwe bleekkop fallow mut. comb. (in standaard)",null,"09",5]
[28012001,"Halsbandparkiet dominant gezoomd groen man",null,"09",5]
[28012002,"Halsbandparkiet dominant gezoomd groen pop",null,"09",5]
[28012900,"Halsbandparkiet niet genoemde dominant gezoomd comb.  kleurslagen",null,"09",5]
[28012999,"Halsbandparkiet nieuwe dominant gezoomd mut. comb. (in standaard)",null,"09",5]
[28013001,"Halsbandparkiet pallid groen man",null,"09",5]
[28013002,"Halsbandparkiet pallid groen pop",null,"09",5]
[28013003,"Halsbandparkiet pallid grijsgroen man",null,"09",5]
[28013004,"Halsbandparkiet pallid grijsgroen pop",null,"09",5]
[28013005,"Halsbandparkiet pallid turquoise man",null,"09",5]
[28013006,"Halsbandparkiet pallid turquoise pop",null,"09",5]
[28013007,"Halsbandparkiet pallid grijs turquoise man",null,"09",5]
[28013008,"Halsbandparkiet pallid grijs turquoise pop",null,"09",5]
[28013009,"Halsbandparkiet pallid blauw man serie",null,"09",5]
[28013010,"Halsbandparkiet pallid blauw pop serie",null,"09",5]
[28013013,"Halsbandparkiet pallid grijsblauw man",null,"09",5]
[28013014,"Halsbandparkiet pallid grijsblauw pop",null,"09",5]
[28013900,"Halsbandparkiet niet genoemde pallid comb.  kleurslagen",null,"09",5]
[28013999,"Halsbandparkiet nieuwe pallid mut. comb.  (in standaard)",null,"09",5]
[28014001,"Halsbandparkiet bleekstaart groen man serie",null,"09",5]
[28014002,"Halsbandparkiet bleekstaart groen pop serie",null,"09",5]
[28014003,"Halsbandparkiet bleekstaart grijsgroen man",null,"09",5]
[28014004,"Halsbandparkiet bleekstaart grijsgroen pop",null,"09",5]
[28014005,"Halsbandparkiet bleekstaart turquoise man serie",null,"09",5]
[28014006,"Halsbandparkiet bleekstaart turquoise pop serie",null,"09",5]
[28014009,"Halsbandparkiet bleekstaart grijs turquoise man",null,"09",5]
[28014010,"Halsbandparkiet bleekstaart grijs turquoise pop",null,"09",5]
[28014011,"Halsbandparkiet bleekstaart blauw man",null,"09",5]
[28014012,"Halsbandparkiet bleekstaart blauw pop",null,"09",5]
[28014015,"Halsbandparkiet bleekstaart grijsblauw man",null,"09",5]
[28014016,"Halsbandparkiet bleekstaart grijsblauw pop",null,"09",5]
[28014900,"Halsbandparkiet niet genoemde bleekstaart comb.  kleurslagen",null,"09",5]
[28014999,"Halsbandparkiet nieuwe bleekstaart mut. comb. (in standaard)",null,"09",5]
[28015001,"Halsbandparkiet dilute groen man",null,"09",5]
[28015002,"Halsbandparkiet dilute groen pop",null,"09",5]
[28015900,"Halsbandparkiet niet genoemde dilute comb.  kleurslagen",null,"09",5]
[28015999,"Halsbandparkiet nieuwe dilute mut. comb. (instandaard)",null,"09",5]
[28016001,"Halsbandparkiet DF misty groen man",null,"09",5]
[28016002,"Halsbandparkiet DF misty groen pop",null,"09",5]
[28017001,"Halsbandparkiet SL ino groen man",null,"09",5]
[28017002,"Halsbandparkiet SL ino groen pop",null,"09",5]
[28017007,"Halsbandparkiet SL ino blauw man",null,"09",5]
[28017008,"Halsbandparkiet SL ino blauw pop",null,"09",5]
[28017900,"Halsbandparkiet niet genoemde SL ino comb.  kleurslagen",null,"09",5]
[28017999,"Halsbandparkiet nieuwe SL ino mut. comb. (in standaard)",null,"09",5]
[28190900,"Halsbandparkiet nieuwe niet erkende mut. en comb.",null,"09",5]
[28190999,"Halsbandparkiet nieuwe mut. en comb. ( in standaard )",null,"09",5]
[28200001,"Rozekopparkiet wildkleur man",null,"09",5]
[28200002,"Rozekopparkiet wildkleur pop",null,"09",5]
[28200003,"Afrikaanse halsbandparkiet wildkleur man",null,"09",5]
[28200004,"Afrikaanse halsbandparkiet wildkleur pop",null,"09",5]
[28200005,"Layards edelparkiet wildkleur man",null,"09",5]
[28200006,"Layards edelparkiet wildkleur pop",null,"09",5]
[28200007,"Laos alexanderparkiet man",null,"09",5]
[28200008,"Laos alexanderparkiet pop",null,"09",5]
[28200011,"Malabarparkiet wildkleur man (duifparkiet)",null,"09",5]
[28200012,"Malabarparkiet wildkleur pop (duifparkiet)",null,"09",5]
[28200013,"Himalaya grijskop edelparkiet wildkleur man",null,"09",5]
[28200014,"Himalaya grijskop edelparkiet wildkleur pop",null,"09",5]
[28200015,"Finsch grijskop edelparkiet wildkleur man",null,"09",5]
[28200016,"Finsch grijskop edelparkiet wildkleur pop",null,"09",5]
[28200017,"Langstaartedelparkiet wildkleur (Malakka) man",null,"09",5]
[28200018,"Langstaartedelparkiet wildkleur (Malakka) pop",null,"09",5]
[28200019,"Indische rozeborstbaardparkiet wildkleur man",null,"09",5]
[28200020,"Indische rozeborstbaardparkiet wildkleur pop",null,"09",5]
[28200021,"Java rozeborstbaardparkiet wildkleur man",null,"09",5]
[28200022,"Java rozeborstbaardparkiet wildkleur pop",null,"09",5]
[28200023,"Dammerman roze borstbaardparkiet wildkleur man",null,"09",5]
[28200024,"Dammerman roze borstbaardparkiet wildkleur pop",null,"09",5]
[28200025,"Nias rozeborstbaard parkiet man",null,"09",5]
[28200026,"Nias rozeborstbaard parkiet pop",null,"09",5]
[28200027,"Simeulue rozeborstbaard parkiet man",null,"09",5]
[28200028,"Simeulue rozeborstbaard parkiet pop",null,"09",5]
[28200029,"Indische halsbandparkiet man",null,"09",5]
[28200030,"Indische halsbandparkiet pop",null,"09",5]
[28200999,"Psittaculasoorten wildkleur niet genoemde overige soorten",null,"09",5]
[28300001,"Indische rozeborstbaardparkiet D groen man",null,"09",5]
[28300002,"Indische rozeborstbaardparkiet D groen pop",null,"09",5]
[28300003,"Indische rozeborstbaardparkiet grijsgroen man",null,"09",5]
[28300004,"Indische rozeborstbaardparkiet grijsgroen pop",null,"09",5]
[28300007,"Indische rozeborstbaardparkiet turquoise man",null,"09",5]
[28300008,"Indische rozeborstbaardparkiet turquoise pop",null,"09",5]
[28300009,"Indische rozeborstbaardparkiet blauw man",null,"09",5]
[28300010,"Indische rozeborstbaardparkiet blauw pop",null,"09",5]
[28300900,"Indische rozeborstbaardparkiet nieuwe nog niet erkende mut. en comb.",null,"09",5]
[28300999,"Indische rozeborstbaardparkiet nieuwe mut. en comb. ( in standaard )",null,"09",5]
[28400001,"Pruimkopparkiet groen man",null,"09",5]
[28400002,"Pruimkopparkiet groen pop",null,"09",5]
[28401001,"Pruimkopparkiet cinnamon groen man",null,"09",5]
[28401002,"Pruimkopparkiet cinnamon groen pop",null,"09",5]
[28401003,"Pruimkopparkiet grijsgroen man",null,"09",5]
[28401004,"Pruimkopparkiet grijsgroen pop",null,"09",5]
[28401005,"Pruimkopparkiet cinnamon grijsgroen man",null,"09",5]
[28401006,"Pruimkopparkiet cinnamon grijsgroen pop",null,"09",5]
[28401900,"Pruimkopparkiet niet genoemde enkelvoudige kleurslagen",null,"09",5]
[28401999,"Pruimkopparkiet nieuwe kleurslag comb. (in standaard)",null,"09",5]
[28402900,"Pruimkopparkiet niet genoemde opaline comb.  kleurslagen",null,"09",5]
[28402999,"Pruimkopparkiet niet genoemde nieuwe opaline comb.  kleurslagen (in standaard)",null,"09",5]
[28403900,"Pruimkopparkiet niet genoemde pastel kleurslagen",null,"09",5]
[28403999,"Pruimkopparkiet nieuwe mut. pastel kleurslagen (in standaard)",null,"09",5]
[28404900,"Pruimkopparkiet niet genoemde dilute kleurslagen",null,"09",5]
[28404999,"Pruimkopparkiet nieuwe dilute comb.  kleurslagen (in standaard)",null,"09",5]
[28405900,"Pruimkopparkiet niet genoemde SL ino kleurslagen",null,"09",5]
[28405999,"Pruimkopparkiet SL ino comb. m/p (in standaard)",null,"09",5]
[28490900,"Pruimkopparkiet nieuwe nog niet erkende mut. en comb.",null,"09",5]
[28490999,"Pruimkopparkiet nieuwe mut. en comb. ( in standaard )",null,"09",5]
[28500001,"Derbyan parkiet wildkleur man",null,10,5]
[28500002,"Derbyan parkiet wildkleur pop",null,10,5]
[28500003,"Nepalese Alexanderparkiet wildkleur man",null,10,5]
[28500004,"Nepalese Alexanderparkiet wildkleur pop",null,10,5]
[28500005,"Grote Alexanderparkiet wildkleur man",null,10,5]
[28500006,"Grote Alexanderparkiet wildkleur pop",null,10,5]
[28500999,"Grote psittacula soorten wildkleur niet genoemd m/p",null,10,5]
[28600006,"Grote Alexanderparkiet blauw man",null,10,5]
[28600007,"Grote Alexanderparkiet blauw pop",null,10,5]
[28600019,"Grote Alexanderparkiet SL ino groen man",null,10,5]
[28600020,"Grote Alexanderparkiet SL ino groen pop",null,10,5]
[28600021,"Grote Alexanderparkiet SL ino blauw m/p",null,10,5]
[28700900,"Grote Alexanderparkiet nieuwe nog niet erkende mut. en comb.",null,10,5]
[28700999,"Grote Alexanderparkiet nieuwe mut. en comb. ( in standaard )",null,10,5]
[29001001,"Witvleugelparkiet groen",null,"07",5]
[29001002,"Kanarievleugelparkiet groen",null,"07",5]
[29001003,"Behns kanarievleugelparkiet groen",null,"07",5]
[29001004,"Toviparkiet groen",null,"07",5]
[29001005,"Oostelijke toviparkiet groen",null,"07",5]
[29001006,"Goudvleugelparkiet groen",null,"07",5]
[29001007,"Kobaltvleugelparkiet groen",null,"07",5]
[29001008,"Vuurvleugelparkiet groen",null,"07",5]
[29001009,"Tuiparkiet groen",null,"07",5]
[29001010,"Tuiparaparkiet groen",null,"07",5]
[29001011,"Tiricaparkiet groen",null,"07",5]
[29001012,"Gustavi kobaltparkiet groen",null,"07",5]
[29001999,"Brotogeris niet genoemde soorten groen",null,"07",5]
[29002001,"Witvleugelparkiet mutanten",null,"07",5]
[29002002,"Kanarievleugelparkiet mutanten",null,"07",5]
[29002003,"Toviparkiet mutanten",null,"07",5]
[29002004,"Kobaltvleugelparkiet mutanten",null,"07",5]
[29002005,"Vuurvleugelparkiet mutanten",null,"07",5]
[29002006,"Tuiparaparkiet mutanten",null,"07",5]
[29002007,"Tuiparkiet mutanten",null,"07",5]
[29002008,"Tiricaparkiet mutanten",null,"07",5]
[29002900,"Brotogeris nieuwe nog niet erkende mut. en comb.",null,"07",5]
[29002999,"Brotogeris nieuwe mut. en comb. ( in standaard )",null,"07",5]
[29100001,"Muisparkiet groen",null,"07",5]
[29104004,"Muisparkiet grijsgroen",null,"07",5]
[29105001,"Muisparkiet aqua",null,"07",5]
[29105005,"Muisparkiet blauw",null,"07",5]
[29105007,"Muisparkiet grijsblauw",null,"07",5]
[29105900,"Muisparkiet niet nog genoemde nieuwe kleurslag comb.",null,"07",5]
[29105999,"Muisparkiet nieuwe mut. en comb. ( in standaard )",null,"07",5]
[29106001,"Muisparkiet pallid groen",null,"07",5]
[29106999,"Muisparkiet nieuwe pallid mut. en comb. ( in standaard )",null,"07",5]
[29107900,"Muisparkiet niet nog genoemde opaline kleurslag comb.",null,"07",5]
[29107999,"Muisparkiet nieuwe pallid mut. en comb. ( in standaard )",null,"07",5]
[29108001,"Muisparkiet SL ino groen",null,"07",5]
[29108005,"Muisparkiet NSL ino groen",null,"07",5]
[29108900,"Muisparkiet niet genoemde NSL en SL ino kleurslag comb.",null,"07",5]
[29190900,"Muisparkiet nieuwe nog niet erkende mut. en comb.",null,"07",5]
[29190999,"Muisparkiet nieuwe mut. en comb. (in standaard)",null,"07",5]
[29200001,"St.Thomas parkiet groen",null,"07",5]
[29200002,"Aruba maisparkiet groen",null,"07",5]
[29200003,"Bonaire maisparkiet groen",null,"07",5]
[29200004,"Bruinkeel maisparkiet groen",null,"07",5]
[29200005,"Guyana maisparkiet groen",null,"07",5]
[29200006,"Venezuela maisparkiet groen",null,"07",5]
[29200007,"Surinaamse maisparkiet groen",null,"07",5]
[29200008,"Cactusparkiet groen",null,"07",5]
[29200009,"Goudvoorhoofd parkiet groen",null,"07",5]
[29200010,"Petz parkiet groen",null,"07",5]
[29200011,"Zuid mexicaanse petz parkiet groen",null,"07",5]
[29210900,"Eupsittula parkiet nieuwe nog niet erkende mut. en comb.",null,"07",5]
[29210999,"Eupsittula parkiet nieuwe mut. en comb. (in standaard)",null,"07",5]
[29211001,"Weddells aratinga groen",null,"07",5]
[29211002,"Zonparkiet groen",null,"09",5]
[29211003,"Goudkap aratinga groen",null,"09",5]
[29211004,"Jendaya parkiet groen",null,"09",5]
[29211005,"Nanday parkiet groen",null,"09",5]
[29211999,"Aratinga parkieten niet genoemde soorten groen",null,"09",5]
[29212001,"Witoog parkiet groen",null,"09",5]
[29212002,"Groene aratinga ",null,"09",5]
[29212003,"Roodkeel parkiet groen",null,"09",5]
[29212004,"Guayaquil parkiet groen",null,"09",5]
[29212005,"Finsch parkiet groen",null,"09",5]
[29212006,"Roodmasker parkiet groen",null,10,5]
[29212007,"Wagler parkiet groen",null,10,5]
[29212008,"Grote Peru parkiet groen",null,10,5]
[29212009,"Kleine Peru parkiet groen",null,10,5]
[29212999,"Psittacara soorten niet genoemd",null,10,5]
[29213001,"Patagonische rotsparkiet wildkleur",null,10,5]
[29213002,"Blauwkop parkiet groen",null,10,5]
[29213003,"Langsnavelparkiet groen ",null,10,5]
[29213004,"Magelhaen parkiet groen ",null,10,5]
[29213005,"Goudparkiet wildkleur",null,10,5]
[29213999,"Enicognathu, thectocercus en cyanoliseu niet genoemde soorten",null,10,5]
[29214001,"Roodmasker parkiet mutanten",null,10,5]
[29214002,"Waglers parkiet mutanten",null,10,5]
[29214003,"Grote peru parkiet mutanten",null,10,5]
[29214004,"Kleine peru parkiet mutanten",null,10,5]
[29214005,"Patagonische rotsparkiet mutanten",null,10,5]
[29214006,"Blauwkop parkiet mutanten",null,10,5]
[29214007,"Langsnavelparkiet mutanten",null,10,5]
[29214008,"Magelhaen parkiet mutanten",null,10,5]
[29214009,"Goudparkiet mutanten",null,10,5]
[29214900,"Grote aratinga en psittacara nieuwe nog niet erkende mut. en comb.",null,10,5]
[29214999,"Grote aratinga en psittacara nieuwe mut. en comb. (in standaard)",null,10,5]
[29215001,"Zonparkiet mutanten",null,"09",5]
[29215002,"Goudkap aratinga mutanten",null,"09",5]
[29215003,"Jendaya parkiet mutanten",null,"09",5]
[29215004,"Nanday parkiet mutanten",null,"09",5]
[29215005,"Witoog parkiet mutanten",null,"09",5]
[29215006,"Groene parkiet mutanten",null,"09",5]
[29215007,"Roodkeel parkiet mutanten",null,"09",5]
[29215008,"Guayaquil parkiet mutanten",null,"09",5]
[29215009,"Finsch parkiet mutanten",null,"09",5]
[29390900,"Grote aratinga en psittacara nieuwe nog niet erkende mut. en comb.",null,"09",5]
[29390999,"Grote aratinga en psittacara nieuwe mut. en comb. (in standaard)",null,"09",5]
[30001001,"Pyrrhura molinae molinae",null,"07",5]
[30001002,"Pyrrhura molinae australis",null,"07",5]
[30001003,"Pyrrhura molinae restricta",null,"07",5]
[30001004,"Pyrrhura molinae hypoxantha",null,"07",5]
[30001005,"Pyrrhura frontalis frontalis",null,"07",5]
[30001006,"Pyrrhura frontalis chiripepe",null,"07",5]
[30001007,"Pyrrhura cruentata",null,"07",5]
[30001008,"Pyrrhura rupicola sandiae",null,"07",5]
[30001009,"Pyrrhura rhodocephala",null,"07",5]
[30001010,"Pyrrhura picta",null,"07",5]
[30001011,"Pyrrhura leucotis",null,"07",5]
[30001012,"Pyrrhura griseipectus",null,"07",5]
[30001013,"Pyrrhura pfrimeri",null,"07",5]
[30001014,"Pyrrhura emma",null,"07",5]
[30001015,"Pyrrhura perlata",null,"07",5]
[30001016,"Pyrrhura lepida",null,"07",5]
[30001017,"Pyrrhura melanura melanura",null,"07",5]
[30001018,"Pyrrhura egregia",null,"07",5]
[30001019,"Pyrrhura hofmani hofmani",null,"07",5]
[30001020,"Pyrrhura hofmani gaudens",null,"07",5]
[30001021,"Pyrrhura roseifrons",null,"07",5]
[30002001,"Pyrrhura molinae violet groen",null,"07",5]
[30002002,"Pyrrhura molinae dilute groen",null,"07",5]
[30002003,"Pyrrhura molinae cinnamon groen",null,"07",5]
[30002004,"Pyrrhura molinae cinnamon turquoise",null,"07",5]
[30002005,"Pyrrhura molinae turquoise",null,"07",5]
[30002006,"Pyrrhura molinae dilute turquoise",null,"07",5]
[30002007,"Pyrrhura molinae violet turquoise",null,"07",5]
[30002008,"Pyrrhura molinae cinnamon dilute groen",null,"07",5]
[30002009,"Pyrrhura molinae cinnamon dilute turquoise",null,"07",5]
[30003001,"Pyrrhura molinae opaline groen (Selectie rood)",null,"07",5]
[30003002,"Pyrrhura molinae opaline groen (Selectie geel)",null,"07",5]
[30003003,"Pyrrhura molinae opaline-cinnamon groen: (Selectie rood)",null,"07",5]
[30003004,"Pyrrhura molinae opaline-cinnamon groen: (Selectie geel)",null,"07",5]
[30003005,"Pyrrhura molinae opaline-cinnamon turquoise: (Selectie rood)",null,"07",5]
[30003006,"Pyrrhura molinae opaline-cinnamon turquoise: (Selectie geel)",null,"07",5]
[30003007,"Pyrrhura molinae opaline-cinnamon dilute groen (Selectie rood):",null,"07",5]
[30003008,"Pyrrhura molinae opaline-cinnamon dilute groen (Selectie geel)",null,"07",5]
[30003009,"Pyrrhura molinae opaline-cinnamon dilute turquoise (Selectie rood):",null,"07",5]
[30003010,"Pyrrhura molinae opaline-cinnamon dilute turquoise (Selectie geel)",null,"07",5]
[30004001,"Pyrrhura molinae opaline NSL ino groen",null,"07",5]
[30004002,"Pyrrhura molinae opaline NSL ino turquoise",null,"07",5]
[30005001,"Pyrrhura molinae DF misty groen",null,"07",5]
[30005002,"Pyrrhura molinae DF misty turquoise",null,"07",5]
[30006001,"Pyrrhura molinae NSL ino groen",null,"07",5]
[30006002,"Pyrrhura molinae NSL ino turquoise",null,"07",5]
[30190900,"Pyrrhura molinae nieuwe nog niet erkende mut. en comb.",null,"07",5]
[30190999,"Pyrrhura molinae nieuwe mut. en comb. (in standaard)",null,"07",5]
[30200001,"Pyrrhura frontalis chiripepe  D groen",null,"07",5]
[30200002,"Pyrrhura frontalis chiripepe  DD groen",null,"07",5]
[30200003,"Pyrrhura frontalis chiripepe fallow groen",null,"07",5]
[30300001,"Pyrrhura rhodocephala D groen",null,"07",5]
[30300002,"Pyrrhura rhodocephala DD groen",null,"07",5]
[30500900,"Pyrrhura soorten nieuwe niet erkende mut. en comb.",null,"07",5]
[30500999,"Pyrrhura soorten nieuwe mut. en comb. (in standaard)",null,"07",5]
[31001001,"Bernstein zwarte lori",null,10,5]
[31001002,"Zwarte lori",null,10,5]
[31001003,"Duivenbode lori",null,10,5]
[31001004,"Geelgestreepte lori",null,10,5]
[31001005,"Groengestreepte lori",null,10,5]
[31001006,"Oranjegestreepte lori",null,10,5]
[31001999,"Chalcopsita breedstaart soorten niet genoemd",null,10,5]
[31002001,"Groenstaartlori",null,10,5]
[31002002,"Purperbuiklori",null,10,5]
[31002003,"Zwartkaplori",null,10,5]
[31002004,"Witneklori",null,10,5]
[31002005,"Purperneklori",null,10,5]
[31002006,"Molukken lori",null,10,5]
[31002007,"Geelmantellori",null,10,5]
[31002008,"Roodborstlori",null,10,5]
[31002009,"Jobi zwartkaplori",null,10,5]
[31002010,"Salvadors zwartkaplori",null,10,5]
[31002011,"Groenstuitlori",null,10,5]
[31002999,"Lorius breedstaart en grote soorten niet genoemd",null,10,5]
[31003001,"Rode lori",null,10,5]
[31003002,"Burulori",null,10,5]
[31003003,"Blauwgestreepte lori",null,10,5]
[31003004,"Blauwoorlori",null,10,5]
[31003005,"Violetneklori",null,10,5]
[31003006,"Obi violetneklori",null,10,5]
[31003007,"Diadeemlori",null,10,5]
[31003999,"Eos grote en kleine niet genoemde soorten",null,10,5]
[31004001,"Witruglori",null,10,5]
[31004002,"Kardinaallori",null,10,5]
[31004999,"Pseudeos niet genoemde grote soorten",null,10,5]
[31005001,"Stella lori",null,10,5]
[31005002,"Rode stellalori",null,10,5]
[31005003,"Josephine lori",null,10,5]
[31005004,"Roodflanklori",null,10,5]
[31005999,"Charmosyna soorten niet genoemd",null,10,5]
[31006001,"Schubbenlori",null,10,5]
[31006002,"Geelgroene lori",null,10,5]
[31006003,"Meyers lori",null,10,5]
[31006004,"Edward lori",null,10,5]
[31006005,"Djampea lori",null,10,5]
[31006006,"Forsten lori",null,10,5]
[31006007,"Soemba lori",null,10,5]
[31006008,"Groenneklori",null,10,5]
[31006009,"Massena lori",null,10,5]
[31006010,"Rosenbergs lori",null,10,5]
[31006011,"Mitchell lori",null,10,5]
[31006012,"Lori van de blauwe bergen",null,10,5]
[31006013,"Roodneklori",null,10,5]
[31006014,"Weber lori",null,10,5]
[31006015,"Ornaatlori",null,10,5]
[31006016,"Geelkoplori",null,10,5]
[31006999,"Trichoglossus soorten niet genoemd",null,10,5]
[31007001,"Viooltjeslori",null,10,5]
[31007002,"Irislori",null,10,5]
[31007003,"Bonte lori",null,10,5]
[31007999,"Psitteuteles soorten niet genoemd",null,10,5]
[31008001,"Stephen lori",null,10,5]
[31008999,"Vini lori niet geneoemde soorten",null,10,5]
[31009001,"Muskuslori",null,10,5]
[31009002,"Purperkroonlori",null,10,5]
[31009999,"Glossopsitta niet genoemde soorten",null,10,5]
[31010001,"Mussenbroek lori",null,10,5]
[31010999,"Neopsittacus lori soorten niet genoemd",null,10,5]
[31011001,"Arfak berglori",null,10,5]
[31011999,"Oreopsittacus niet genoemde kleine lori soorten",null,10,5]
[31012001,"Gekraagde lori",null,10,5]
[31012999,"Phigys niet genoemde kleine lori soorten",null,10,5]
[31200900,"Lori soorten nog niet erkende nieuwe mut. en comb.",null,10,5]
[31200999,"Lori soorten nieuwe mut. en comb. m/p (in standaard)",null,10,5]
[31300001,"Blauwkroontje",null,"07",5]
[31300002,"Filippijnse hangparkiet",null,"07",5]
[31300003,"Sulawesi hangparkiet",null,"07",5]
[31300004,"Lentepapegaaitje",null,"07",5]
[31300100,"Hangparkietjes niet genoemde soorten",null,"07",5]
[31301900,"Hangparkieten niet erkende nieuwe mut. en comb.",null,"07",5]
[31301999,"Hangparkieten  nieuwe mut. en comb. m/p (in standaard)",null,"07",5]
[31400001,"Desmares tvijgpapegaai",null,"07",5]
[31400002,"Salvador vijgpapegaai",null,"07",5]
[31400003,"Edward vijgpapegaai",null,"07",5]
[31401001,"Oranjeborstvijgpapegaai",null,"07",5]
[31401002,"Dubbeloog vijgparkiet",null,"07",5]
[31450100,"Vijgpapegaaien niet genoemde soorten",null,"07",5]
[31500900,"Vijgpapegaaien niet erkende nieuwe mut. en comb.",null,"07",5]
[31500999,"Vijgpapegaaien nieuwe mut. en comb. m/p (in standaard)",null,"07",5]
[32001001,"Witbuikcaique",null,10,7]
[32001002,"Geeldij witbuikcaique",null,10,7]
[32001003,"Zwartkopcaique",null,10,7]
[32001999,"Caique niet genoemde  soorten",null,10,7]
[32002001,"Bronsvleugelpionus",null,10,7]
[32002002,"Grijskoppionus",null,10,7]
[32002003,"Koraalsnavelpionus",null,10,7]
[32002004,"Maximiliaan pionus",null,10,7]
[32002005,"Viooltjespionus",null,10,7]
[32002006,"Witkoppionus",null,10,7]
[32002007,"Zwartoorpionus",null,10,7]
[32002999,"Pionus niet genoemde soorten ",null,10,7]
[32003001,"Bruinkoppapegaai",null,10,7]
[32003002,"Meyer papegaai",null,10,7]
[32003003,"Roodbuikpapegaai",null,10,7]
[32003004,"Senegalpapegaai",null,10,7]
[32003005,"Ruppel papegaai",null,10,7]
[32003006,"Kongo papegaai",null,10,7]
[32003007,"Kaapse papegaai",null,10,7]
[32003999,"Pionus niet genoemde soorten ",null,10,7]
[32004001,"Grijzeroodstaartpapegaai",null,10,7]
[32004002,"Timneh grijzeroodstaartpapegaai",null,10,7]
[32004003,"Grote vasa papegaai",null,10,7]
[32004004,"Kleine vasa papegaai",null,10,7]
[32004005,"Kraagparkiet",null,10,7]
[32004999,"Afrikaanse pagegaaien niet genoemde soorten ",null,10,7]
[32005001,"Cornelia edelpapegaai man",null,10,7]
[32005002,"Cornelia edelpapegaai pop",null,10,7]
[32005003,"Australische edelpapegaai man",null,10,7]
[32005004,"Australische edelpapegaai pop",null,10,7]
[32005005,"Nieuw guinea edelpapegaai man",null,10,7]
[32005006,"Nieuw guinea edelpapegaai pop",null,10,7]
[32005007,"Solomons edelpapegaai man",null,10,7]
[32005008,"Solomons edelpapegaai pop",null,10,7]
[32005009,"Halmahera edelpapegaai man",null,10,7]
[32005010,"Halmahera edelpapegaai pop",null,10,7]
[32005011,"Blauwschedeledelpapegaai m/p",null,10,7]
[32005012,"Zwartschouderedelpapegaai m/p",null,10,7]
[32005013,"Mullers edelpapegaai m/p",null,10,7]
[32005014,"Blauwbuikpapegaai man",null,10,7]
[32005015,"Blauwbuikpapegaai pop",null,10,7]
[32005999,"Edelpapegaai niet genoemde soorten m/p",null,10,7]
[32006001,"Blauwvoorhoofd amazonepapegaai",null,10,7]
[32006002,"Blauwbaard amazonepapegaai",null,10,7]
[32006003,"Blauwwang amazone papegaai",null,10,7]
[32006004,"Cuba amazonepapegaai",null,10,7]
[32006005,"Dubbele geelkop amazonepapegaai",null,10,7]
[32006006,"Finch amazonepapegaai",null,10,7]
[32006007,"Geelbuik amazonepapegaai",null,10,7]
[32006008,"Geelnek amazonepapegaai",null,10,7]
[32006009,"Geelschouderblauwvoorhoofd amazonepapegaai",null,10,6]
[32006010,"Geelschouder amazonepapegaai",null,10,7]
[32006011,"Geelteugelamazonepapegaai",null,10,7]
[32006012,"Geelvoorhoofd amazonepapegaai",null,10,7]
[32006013,"Geelwang amazonepapegaai",null,10,7]
[32006014,"Groenwang amazonepapegaai",null,10,7]
[32006015,"Hispaniola amazonepapegaai",null,10,7]
[32006016,"Keizer amazonepapegaai",null,10,7]
[32006017,"Konings amazonepapegaai",null,10,7]
[32006018,"Marajo amazonepapegaai",null,10,7]
[32006019,"Muller amazonepapegaai",null,10,7]
[32006020,"Oranjevleugel amazonepapegaai",null,10,7]
[32006021,"Panama amazonepapegaai",null,10,7]
[32006022,"Puerto Rico amazonepapegaai",null,10,7]
[32006023,"Pracht amazonepapegaai",null,10,7]
[32006024,"Roodkeel amazonepapegaai",null,10,7]
[32006025,"Roodstaart amazonepapegaai",null,10,7]
[32006026,"Salvin amazonepapegaai",null,10,7]
[32006027,"Soldaten amazonepapegaai",null,10,7]
[32006028,"Tucumanamazonepapegaai",null,10,7]
[32006029,"Wijnborst amazonepapegaai",null,10,7]
[32006030,"Witvoorhoofd amazonepapegaai",null,10,7]
[32006999,"Amazone papegaai niet genoemde soorten",null,10,7]
[32007001,"Witte kaketoe",null,10,7]
[32007002,"Ducorp kaketoe",null,10,7]
[32007003,"Grote geelkuifkaketoe",null,10,7]
[32007004,"Triton kaketoe",null,10,7]
[32007005,"Goffini kaketoe",null,10,7]
[32007006,"Philippijnse kaketoe",null,10,7]
[32007007,"Inca kaketoe",null,10,7]
[32007008,"Molukken kaketoe",null,10,7]
[32007009,"Naaktoog kaketoe",null,10,7]
[32007010,"Kleine geelkuifkaketoe",null,10,7]
[32007011,"Langsnavel naaktoog kaketoe",null,10,7]
[32007012,"Langsnavel kaketoe",null,10,7]
[32007013,"Blauwoog kaketoe",null,10,7]
[32007014,"Helmkaketoe",null,10,7]
[32007015,"Rose kaketoe",null,10,7]
[32007016,"Palm kaketoe",null,10,7]
[32007017,"Roodstaartraaf kakatoe",null,10,7]
[32007999,"Kakatoe niet genoemde soorten",null,10,7]
[32008001,"Hyacint ara",null,10,7]
[32008002,"Lear ara",null,10,7]
[32008003,"Grote soldaten ara",null,10,7]
[32008004,"Blauwgele ara",null,10,7]
[32008005,"Groenvleugel ara",null,10,7]
[32008006,"Blauwkeel ara",null,10,7]
[32008007,"Geelvleugel ara",null,10,7]
[32008008,"Soldaten ara",null,10,7]
[32008009,"Roodoorara",null,10,7]
[32008010,"Hahn dwerg ara",null,10,7]
[32008011,"Spix ara",null,10,7]
[32008012,"Roodschouderara",null,10,7]
[32008013,"Roodbuikara",null,10,7]
[32008014,"Geelnekara",null,10,7]
[32008015,"Blauwkop dwerg ara",null,10,7]
[32008016,"Illigerara",null,10,7]
[32008999,"Ara niet genoemde soorten",null,10,7]
[33001001,"Diamantduif wildkleur",null,"08",3]
[33002001,"Diamantduif bruin",null,"08",3]
[33002002,"Diamantduif topaas",null,"08",3]
[33002003,"Diamantduif bruintopaas",null,"08",3]
[33002004,"Diamantduif pastel",null,"08",3]
[33002005,"Diamantduif bruinpastel",null,"08",3]
[33002006,"Diamantduif gezoomd",null,"08",3]
[33002007,"Diamantduif bruin gezoomd",null,"08",3]
[33002008,"Diamantduif pastel gezoomd",null,"08",3]
[33002009,"Diamantduif bruinpastel gezoomd",null,"08",3]
[33002011,"Diamantduif EF Pheao egaal",null,"08",3]
[33002012,"Diamantduif DF Pheao egaal",null,"08",3]
[33002013,"Diamantduif bont",null,"08",3]
[33002014,"Diamantduif bont bruin",null,"08",3]
[33002015,"Diamantduif wit (zwartoog)",null,"08",3]
[33002016,"Diamantduif albino",null,"08",3]
[33003001,"Diamantduif EF witstuit",null,"08",3]
[33003002,"Diamantduif EF witstuit bruin",null,"08",3]
[33003003,"Diamantduif EF witstuit topaas",null,"08",3]
[33003004,"Diamantduif EF witstuit bruintopaas",null,"08",3]
[33003005,"Diamantduif EF witstuit pastel",null,"08",3]
[33003006,"Diamantduif EF witstuit bruinpastel",null,"08",3]
[33003007,"Diamantduif EF witstuit gezoomd",null,"08",3]
[33003008,"Diamantduif EF witstuit bruin gezoomd ",null,"08",3]
[33104900,"Diamantduif nieuwe nog niet erkende mut. en comb.",null,"08",3]
[33104999,"Diamantduif nieuwe mut. en comb. (in standaard)",null,"08",3]
[33105001,"Buckley duifje",null,"08",3]
[33105002,"Dwergduifje",null,"08",3]
[33105003,"Inca duifje",null,"08",3]
[33105004,"Musduifje",null,"08",3]
[33105005,"Peru duifje",null,"08",3]
[33105006,"Picui duifje",null,"08",3]
[33105007,"Talpacoti duifje",null,"08",3]
[33105999,"Columbina overige niet genoemde soorten",null,"08",3]
[33106001,"Blauwkop bosduifje",null,"08",3]
[33106002,"Bronsvlekduifje",null,"08",3]
[33106003,"Staalvlekduifje",null,"08",3]
[33106004,"Zwartsnavelduifje",null,"08",3]
[33106005,"Tamboerijnduifje",null,"08",3]
[33106999,"Turtur overige niet genoemde soorten",null,"08",3]
[33107001,"Kopernekduif",null,"08",3]
[33107002,"Timorduifje",null,"08",3]
[33107003,"Vredesduifje",null,"08",3]
[33107004,"Zebra duifje",null,"08",3]
[33107005,"Brilduifje",null,"08",3]
[33107006,"Zwartvleugelduifje",null,"08",3]
[33107007,"Zwartmaskerduifje",null,"08",3]
[33107999,"Geopelia, oena  en metriopelia overige niet genoemde soorten",null,"08",3]
[33109001,"Musduifje pastel",null,"08",3]
[33110001,"Vredesduifje bruin",null,"08",3]
[33110002,"Vredesduifje phaeo",null,"08",3]
[33110003,"Zebra duifje bruin ",null,"08",3]
[33110004,"Zebra duifje phaeo",null,"08",3]
[33111900,"Overige duiven soorten nieuwe niet erkende mut. en comb.",null,"08",3]
[33111999,"Overige duiven soorten nieuwe mut. en comb. (in standaard)",null,"08",3]
[33112001,"Witvleugelduif",null,"09",3]
[33112002,"Oorvlekduif",null,"09",3]
[33112003,"Carolina duif",null,"09",3]
[33112004,"Treurdeuf",null,"09",3]
[33112005,"Graysonduif",null,"09",3]
[33113001,"Martinique duif",null,"09",3]
[33113002,"Groenvleugelduif",null,"09",3]
[33113003,"Stephan groenvleugelduif",null,"09",3]
[33113999,"Melpelia, Zenaida een Chalcophaps overige niet genoemde duiven soorten",null,"09",3]
[33114001,"Java tortelduif",null,"09",3]
[33114002,"Kaapse tortelduif",null,"09",3]
[33114003,"Parelhals tortelduif",null,"09",3]
[33114004,"Kleine parelhalstortelduif",null,"09",3]
[33114005,"Treurtortelduif",null,"09",3]
[33114006,"Rouw tortelduif",null,"09",3]
[33114007,"Oosterse tortelduif",null,"09",3]
[33114008,"Madagascar tortelduif",null,"09",3]
[33114009,"Afrikaanse tortelduif",null,"09",3]
[33114010,"Roodoog tortelduif",null,"09",3]
[33114011,"Senegal duif wildkleur",null,"09",3]
[33114012,"Rode birma tortelduif",null,"09",3]
[33114013,"Wijnrode tortelduif",null,"09",3]
[33114999,"Streptopelia niet genoemde uitheemse soorten duiven ",null,"09",3]
[33115001,"Grijskopduif",null,"09",3]
[33115002,"Blauwringduif",null,"09",3]
[33115003,"Grijsborstduif",null,"09",3]
[33115999,"Leptotila overige niet genoemde soorten duiven ",null,"09",3]
[33116001,"Rode grondduif",null,"09",3]
[33116002,"Jamaica grondduif",null,"09",3]
[33116003,"Baardstreep grondduif",null,"09",3]
[33116999,"Geotrygon overige niet genoemde soorten duiven ",null,"09",3]
[33117001,"Bartlett dolksteekduif",null,"09",3]
[33117002,"Dolksteekduif",null,"09",3]
[33117003,"Goudborstgrondduif",null,"09",3]
[33117004,"Celebesgrondduif",null,"09",3]
[33117999,"Gallicolumba niet genoemde soorten duiven ",null,"09",3]
[33118001,"Blauwe grondduif",null,"09",3]
[33118999,"Claravis niet genoemde soorten duiven ",null,"09",3]
[33119001,"Olijfduif",null,"09",3]
[33119002,"Laurierduif",null,"09",3]
[33119003,"Witkop cuba duif",null,"09",3]
[33119004,"Witkopduif",null,"09",3]
[33119005,"Sneeuwduif",null,"09",3]
[33119006,"Vlekkenduif",null,"09",3]
[33119007,"Salvinduif",null,"09",3]
[33119008,"Roodrugduif",null,"09",3]
[33119009,"Alablanca duif",null,"09",3]
[33119010,"Schubbenhalsduif",null,"09",3]
[33119011,"Witkeelduif",null,"09",3]
[33119012,"Metaalbosduif",null,"09",3]
[33119013,"Paarse woudduif",null,"09",3]
[33119014,"Vlekkenduif",null,"09",3]
[33119015,"Bandstaartduif",null,"09",3]
[33119016,"Roodnekduif",null,"09",3]
[33119017,"Picazuro duif",null,"09",3]
[33119018,"Roodsnavelduif",null,"09",3]
[33119019,"Guinea duif",null,"09",3]
[33119020,"Nepalduif",null,"09",3]
[33119021,"Purperduif",null,"09",3]
[33119999,"Columba niet genoemde soorten duiven",null,"09",3]
[33120001,"Maleise koekoeksduif",null,"09",3]
[33120002,"Roseborst koekoeksduif",null,"09",3]
[33121001,"Witkopkoekoeksduif",null,"09",3]
[33121003,"Lemonduif",null,"09",3]
[33121999,"Turacoena en Aplopelia duiven soorten niet genoemd ",null,"09",3]
[33122001,"Bronsvleugelduif",null,"09",3]
[33122002,"Sierlijke bronsvleugelduif",null,"09",3]
[33123001,"Australische kuifduif wildkleur",null,"09",3]
[33124001,"Wonga duif",null,"09",3]
[33124002,"Manenduif",null,"09",3]
[33124003,"Bandstaartduif",null,"09",3]
[33124999,"Leucosarcia, Caloennas en Patagioenas niet genoemde soorten",null,"09",3]
[33125001,"Senegaltortelduif bruin",null,"09",3]
[33125002,"Senegaltortelduif pastel",null,"09",3]
[33125900,"Tortelduif soorten nog niet erkende mut. en comb. m/p",null,"09",3]
[33125999,"Tortelduif soorten nieuwe mut. en comb. m/p (in standaard)",null,"09",3]
[33126001,"Guinea duif ino",null,"09",3]
[33127001,"Australische kuifduif bruin",null,"09",3]
[33128900,"Overige duiven soorten nieuwe nog niet erkende mut. en comb.",null,"09",3]
[33128999,"Overige duiven soorten nieuwe mut. en comb. (in standaard)",null,"09",3]
[33129001,"Pinnon muskaatduif",null,"09",3]
[33129002,"Bonte muskaatduif",null,"09",3]
[33129003,"Celebes muskaatduif",null,"09",3]
[33129999,"Niet genoemde ducula vruchtenduif soorten ",null,"09",3]
[33130001,"Oranjevoorhoofd vruchtenduif",null,"09",3]
[33130002,"Jambu vruchtenduif",null,"09",3]
[33130003,"Oranjebuik vruchtenduif",null,"09",3]
[33130004,"Zwartnek vruchtenduif",null,"09",3]
[33130005,"Karmozijnkap vruchtenduif",null,"09",3]
[33130999,"Niet genoemde Ptilinopus vruchtenduif soorten",null,"09",3]
[33131001,"Afrikaanse Groene vruchtenduif",null,"09",3]
[33131002,"Rozenek groene vruchtenduif",null,"09",3]
[33132999,"Vruchtenduiven niet genoemde soorten wildkleur",null,"09",3]
[33133001,"Lachduif wildkleur",null,"09",3]
[33134001,"Lachduif agaat",null,"09",3]
[33134002,"Lachduif grijs",null,"09",3]
[33134003,"Lachduif isabel",null,"09",3]
[33134004,"Lachduif ivoor",null,"09",3]
[33134005,"Lachduif SL ino",null,"09",3]
[33134006,"Lachduif witte zwartoog",null,"09",3]
[33134007,"Lachduif NSL ino (albino)",null,"09",3]
[33134008,"Lachduif EF pheao egaal",null,"09",3]
[33134009,"Lachduif DF phaeo egaal",null,"09",3]
[33135001,"Lachduif EF phaeo gezoomd",null,"09",3]
[33135002,"Lachduif DF phaeo gezoomd",null,"09",3]
[33135003,"Lachduif agaat EF pheao egaal",null,"09",3]
[33135004,"Lachduif agaat DF phaeo egaal",null,"09",3]
[33135005,"Lachduif agaat DF phaeo gezoomd",null,"09",3]
[33135006,"Lachduif agaatgrijs",null,"09",3]
[33135007,"Lachduif agaatisabel",null,"09",3]
[33135008,"Lachduif witkop",null,"09",3]
[33135009,"Lachduif witkop DF phaeo egaal",null,"09",3]
[33135010,"Lachduif witkop DF phaeo gezoomd",null,"09",3]
[33135011,"Lachduif witkop isabel",null,"09",3]
[33135012,"Lachduif witkop agaat",null,"09",3]
[33135013,"Lachduif kleurkop",null,"09",3]
[33135014,"Lachduif kleurkop grijs",null,"09",3]
[33135015,"Lachduif kleurkop agaat",null,"09",3]
[33135016,"Lachduif schimmel",null,"09",3]
[33135017,"Lachduif bont",null,"09",3]
[33135018,"Lachduif met puntkuif",null,"09",3]
[33135019,"Lachduif met schelpkuif",null,"09",3]
[33190900,"Lachduif nieuwe nog niet erkende mut. en comb.",null,"09",3]
[33190999,"Lachduif nieuwe mut. en comb. (in standaard)",null,"09",3]
[34001001,"Chinese dwergkwartel wildkleur haan",null,"08",3]
[34001002,"Chinese dwergkwartel wildkleur hen",null,"08",3]
[34002001,"Chinese dwergkwartel mokkabruin haan",null,"08",3]
[34002002,"Chinese dwergkwartel mokkabruin hen",null,"08",3]
[34002003,"Chinese dwergkwartel opaal haan",null,"08",3]
[34002004,"Chinese dwergkwartel opaal hen",null,"08",3]
[34002005,"Chinese dwergkwartel topaas haan",null,"08",3]
[34002006,"Chinese dwergkwartel topaas hen",null,"08",3]
[34002007,"Chinese dwergkwartel pastel haan",null,"08",3]
[34002008,"Chinese dwergkwartel pastel hen",null,"08",3]
[34002009,"Chinese dwergkwartel geparelde haan",null,"08",3]
[34002010,"Chinese dwergkwartel geparelde hen",null,"08",3]
[34002011,"Chinese dwergkwartel zonder keeltekening haan",null,"08",3]
[34002012,"Chinese dwergkwartel zonder keeltekening hen",null,"08",3]
[34002013,"Chinese dwergkwartel roodborst haan",null,"08",3]
[34002014,"Chinese dwergkwartel roodborst hen",null,"08",3]
[34002015,"Chinese dwergkwartel getekende haan",null,"08",3]
[34002016,"Chinese dwergkwartel getekende hen",null,"08",3]
[34002017,"Chinese dwergkwartel wit (zwartoog) haan/hen",null,"08",3]
[34003001,"Chinese dwergkwartel gepareld mokkabruin haan",null,"08",3]
[34003002,"Chinese dwergkwartel gepareld mokkabruin hen",null,"08",3]
[34003003,"Chinese dwergkwartel gepareld opaal haan",null,"08",3]
[34003004,"Chinese dwergkwartel gepareld opaal hen",null,"08",3]
[34003005,"Chinese dwergkwartel gepareld topaas haan",null,"08",3]
[34003006,"Chinese dwergkwartel gepareld topaas hen",null,"08",3]
[34004001,"Chinese dwergkwartel zonder keeltekening mokkabruin haan",null,"08",3]
[34004002,"Chinese dwergkwartel zonder keeltekening mokkabruin hen",null,"08",3]
[34004003,"Chinese dwergkwartel zonder keeltekening opaal haan",null,"08",3]
[34004004,"Chinese dwergkwartel zonder keeltekening opaal hen",null,"08",3]
[34004005,"Chinese dwergkwartel zonder keeltekening topaas haan",null,"08",3]
[34004006,"Chinese dwergkwartel zonder keeltekening topaas hen",null,"08",3]
[34005001,"Chinese dwergkwartel roodborst mokkabruin haan",null,"08",3]
[34005002,"Chinese dwergkwartel roodborst mokkabruin hen",null,"08",3]
[34005003,"Chinese dwergkwartel roodborst opaal haan",null,"08",3]
[34005004,"Chinese dwergkwartel roodborst opaal hen",null,"08",3]
[34005005,"Chinese dwergkwartel roodborst topaas haan",null,"08",3]
[34005006,"Chinese dwergkwartel roodborst topaas hen",null,"08",3]
[34006001,"Chinese dwergkwartel getekend mokkabruin haan",null,"08",3]
[34006002,"Chinese dwergkwartel getekend mokkabruin hen",null,"08",3]
[34006003,"Chinese dwergkwartel getekend opaal haan",null,"08",3]
[34006004,"Chinese dwergkwartel getekend opaal hen",null,"08",3]
[34006005,"Chinese dwergkwartel getekend gepareld haan",null,"08",3]
[34006006,"Chinese dwergkwartel getekend gepareld hen",null,"08",3]
[34006007,"Chinese dwergkwartel getekend roodborst haan",null,"08",3]
[34006008,"Chinese dwergkwartel getekend roodborst hen",null,"08",3]
[34190900,"Chinese dwergkwartel nieuwe  nog niet erkende mut. en comb. haan/hen",null,"08",3]
[34190999,"Chinese dwergkwartel nieuwe mut. en comb. haan/hen (in standaard)",null,"08",3]
[34201001,"Coromandelkwartel haan/hen",null,"08",3]
[34201002,"Harlekijnkwartel haan/hen",null,"08",3]
[34201999,"Coturnix kwartels niet genoemde soorten wildkleur",null,"08",3]
[34202001,"Harlekijnkwartel bruin haan/hen",null,"08",3]
[34202002,"Harlekijnkwartel pastel haan/hen",null,"08",3]
[34300900,"Overige kwartels nieuwe nog niet erkende mut. en comb.",null,"08",3]
[34300999,"Overige kwartels nieuwe mut. en comb. (in standaard)",null,"08",3]
[34400001,"Japanse kwartel wildkleur haan/hen",null,"09",3]
[34401001,"Japanse kwartel bruin haan/hen",null,"09",3]
[34401002,"Japanse kwartel mokkabruin haan/hen",null,"09",3]
[34401003,"Japanse kwartel roodbruin haan/hen",null,"09",3]
[34401004,"Japanse kwartel grijs haan/hen",null,"09",3]
[34401005,"Japanse kwartel topaas haan/hen",null,"09",3]
[34401006,"Japanse kwartel pastel haan/hen",null,"09",3]
[34401020,"Japanse kwartel getekend alle kleurslagen haan/hen",null,"09",3]
[34401021,"Japanse kwartel wit haan/hen",null,"09",3]
[34401022,"Japanse kwartel albino haan/hen",null,"09",3]
[34402001,"Japanse kwartel zonder keeltekening",null,"09",3]
[34402002,"Japanse kwartel zonder keeltekening bruin",null,"09",3]
[34402003,"Japanse kwartel zonder keeltekening roodbruin",null,"09",3]
[34402004,"Japanse kwartel zonder keeltekening pastel",null,"09",3]
[34403001,"Japanse kwartel pastel bruin",null,"09",3]
[34403002,"Japanse kwartel pastel roodbruin",null,"09",3]
[34403003,"Japanse kwartel pastel zonder keeltekening",null,"09",3]
[34404001,"Japanse kwartel zonder keel- met streeptekening",null,"09",3]
[34404002,"Japanse kwartel zonder keel- met streeptekening bruin",null,"09",3]
[34404003,"Japanse kwartel zonder keel- met streeptekening roodbruin",null,"09",3]
[34404004,"Japanse kwartel zonder keel- met streeptekening pastel",null,"09",3]
[34404005,"Japanse kwartel zonder keel- met streeptekening pastelbruin",null,"09",3]
[34404006,"Japanse kwartel zonder keel- met streeptekening pastelroodbruin",null,"09",3]
[34404900,"Japanse kwartels nieuwe nog niet erkende mut. en comb.",null,"09",3]
[34404999,"Japanse kwartels nieuwe mut. en comb. (in standaard)",null,"09",3]
[34500001,"Montezumakwartel",null,"09",3]
[34500002,"Bergkuifkwartel",null,"09",3]
[34500003,"Blauwschubben kwartel",null,"09",3]
[34500004,"Californische kuifkwartel",null,"09",3]
[34500005,"Elegantkwartel",null,"09",3]
[34500006,"Gambel kuifkwartel",null,"09",3]
[34500007,"Kortkuifkwartel",null,"09",3]
[34500008,"Virginische boomkwartel",null,"09",3]
[34500999,"Overige Colinus, Callipepla, Oreortyx, Cyrtonyx soorten niet genoemd",null,"09",3]
[34510001,"Virginische boomkwartel bruin",null,"09",3]
[34510002,"Virginische boomkwartel grijs",null,"09",3]
[34510003,"Virginische boomkwartel pastel",null,"09",3]
[34510004,"Virginische boomkwartel gepareld",null,"09",3]
[34510900,"Virginische boomkwartel  nieuwe nog niet erkende mut. en comb.",null,"09",3]
[34510999,"Virginische boomkwartel  nieuwe mut. en comb. (in standaard)",null,"09",3]
[34601001,"Zwartborstvechtkwartel",null,"08",3]
[34601002,"Roulroul",null,"09",3]
[34601003,"Arabische steenpatrijs",null,"09",3]
[34601004,"Philbypatrijs",null,"09",3]
[34601005,"Arabische zandpatrijs",null,"09",3]
[34601006,"Perzische zandpatrijs",null,"09",3]
[34601007,"Bruinborst heuvelpatrijs",null,"09",3]
[34601008,"Ricketpatrijs",null,"09",3]
[34601009,"Javaanse bospatrijs",null,"09",3]
[34601010,"Sumatraanse heuvelpatrijs",null,"09",3]
[34601011,"Sumatraanse bospatrijs",null,"09",3]
[34601012,"Roodkeel heuvelpatrijs",null,"09",3]
[34601013,"Tibetaanse heuvelpatrijs",null,"09",3]
[34601014,"Chinese bamboepatrijs",null,"09",3]
[34601015,"Bergbamboepatrijs",null,"09",3]
[34601016,"Rode bospatrijs",null,"09",3]
[34601017,"Parelpatrijs",null,"09",3]
[34601018,"Baardpatrijs",null,"09",3]
[34601019,"Roodbuikzandhoen",null,"09",3]
[34601020,"Halsband frankolijn",null,"09",3]
[34601999,"Overige grondvogels wildkleur niet genoemde soorten",null,"09",3]
[34701001,"Witborstral",null,"09",3]
[34701002,"Australische bandral",null,"09",3]
[34701999,"Niet genoemde Rallen en Tinamoes muv plevieren, kievieten",null,"09",3]
[37016001,"Kruisbek man (Biotoop)",null,12,3]
[37016002,"Kruisbek pop (Biotoop)",null,12,3]
[37016003,"Grote Kruisbek man (Biotoop)",null,12,3]
[37016004,"Grote kruisbek pop (Biotoop)",null,12,3]
[37016005,"Schotse Kruisbek man (Biotoop)",null,12,3]
[37016006,"Schotse Kruisbek pop (Biotoop)",null,12,3]
[37016007,"Witband Kruisbek man (Biotoop)",null,12,3]
[37016008,"Witband Kruisbek pop (Biotoop)",null,12,3]
[37017001,"Appelvink m/p (Biotoop)",null,12,3]
[37017002,"Haakbek man (Biotoop)",null,12,3]
[37017003,"Haakbek pop (Biotoop)",null,12,3]
[37018001,"Koolmees m/p (Biotoop)",null,12,5]
[37018002,"Pimpelmees m/p (Biotoop)",null,12,5]
[37018003,"Staartmees m/p (Biotoop)",null,12,5]
[37018004,"Matkopmees m/p (Biotoop)",null,12,5]
[37018005,"Kuifmees m/p (Biotoop)",null,12,5]
[37018006,"Azuurmees m/p (Biotoop)",null,12,5]
[37018007,"Zwartemees m/p (Biotoop)",null,12,5]
[37018008,"Baardmannetje man (Biotoop)",null,12,5]
[37018009,"Baardmannetje pop (Biotoop)",null,12,5]
[37018010,"Winterkoninkje m/p (Biotoop)",null,12,5]
[37018011,"Roodborstje m/p (Biotoop)",null,12,5]
[37018012,"Zwartkop man (Biotoop)",null,12,5]
[37018013,"Zwartkop pop (Biotoop)",null,12,5]
[37018014,"Blauwstaartje m/p (Biotoop)",null,12,5]
[37018015,"Gekraagde roodstaart m/p (Biotoop)",null,12,5]
[37018016,"Zwarte roodstaart m/p (Biotoop)",null,12,5]
[37018017,"Witte kwikstaart m/p (Biotoop)",null,12,5]
[37018018,"Grote gele kwikstaart m/p (Biotoop)",null,12,5]
[37018019,"Gele kwikstaart m/p (Biotoop)",null,12,5]
[37018020,"Wit gesternde blauwborst m/p (Biotoop)",null,12,5]
[37018021,"Rood gesternde blauwborst m/p (Biotoop)",null,12,5]
[37018022,"Boomklever m/p (Biotoop)",null,12,5]
[37018023,"Boomkruiper m/p (Biotoop)",null,12,5]
[37018024,"Goudhaantje m/p (Biotoop)",null,12,5]
[37018025,"Vuurgoudhaantje m/p (Biotoop)",null,12,5]
[37018999,"Europese cultuur VI groep 1 niet genoemde soorten  (Biotoop)",null,12,5]
[37019001,"Rietzanger m/p (Biotoop)",null,12,5]
[37019002,"Braamsluiper m/p (Biotoop)",null,12,5]
[37019003,"Grasmus m/p (Biotoop)",null,12,5]
[37019004,"Sperwer grasmus m/p (Biotoop)",null,12,5]
[37019005,"Tuinfluiter m/p (Biotoop)",null,12,5]
[37019006,"Fitis m/p (Biotoop)",null,12,5]
[37019007,"Heggenmus m/p (Biotoop)",null,12,5]
[37019008,"Veldleeuwerik m/p (Biotoop)",null,12,5]
[37019009,"Kuifleeuwerik m/p (Biotoop)",null,12,5]
[37019010,"Boomleeuwerik m/p (Biotoop)",null,12,5]
[37019011,"Graspieper m/p (Biotoop)",null,12,5]
[37019012,"Boompieper m/p (Biotoop)",null,12,5]
[37019013,"Tapuit m/p (Biotoop)",null,12,5]
[37019014,"Roodborst tapuit m/p (Biotoop)",null,12,5]
[37019015,"Isabel tapuit (Biotoop)",null,12,5]
[37019016,"Zwarte tapuit m/p (Biotoop)",null,12,5]
[37019017,"Blonde tapuit m/p (Biotoop)",null,12,5]
[37019018,"Europese nachtegaal m/p (Biotoop)",null,12,5]
[37019019,"Roodkeel nachtegaal m/p (Biotoop)",null,12,5]
[37019020,"Tjiftjaf m/p (Biotoop)",null,12,5]
[37019021,"Bonte vliegenvanger m/p (Biotoop)",null,12,5]
[37019022,"Grauwe vliegenvanger m/p (Biotoop)",null,12,5]
[37019999,"Europese cultuur VI groep 2 niet genoemde soorten (Biotoop)",null,12,5]
[37020001,"Spreeuw m/p (Biotoop)",null,12,5]
[37020002,"Zwarte spreeuw m/p (Biotoop)",null,12,5]
[37020003,"Rose spreeuw m/p (Biotoop)",null,12,5]
[37020004,"Pestvogel m/p (Biotoop)",null,12,5]
[37020999,"Europese cultuur VI Groep 3 niet genoemde soorten  (Biotoop)",null,12,5]
[37021001,"Merel man (Biotoop)",null,12,5]
[37021002,"Merel pop (Biotoop)",null,12,5]
[37021003,"Zanglijster m/p (Biotoop)",null,12,5]
[37021004,"Grote lijster m/p (Biotoop)",null,12,5]
[37021005,"Koperwiek m/p (Biotoop)",null,12,5]
[37021006,"Kramsvogel m/p (Biotoop)",null,12,5]
[37021007,"Beflijster man (Biotoop)",null,12,5]
[37021008,"Beflijster pop (Biotoop)",null,12,5]
[37021999,"Europese cultuur VI Groep 4 niet genoemde soorten  (Biotoop)",null,12,5]
[37022001,"Grauwe klauwier m/p (Biotoop)",null,12,5]
[37022002,"Roodkop klauwier m/p (Biotoop)",null,12,5]
[37022003,"Klapekster m/p (Biotoop)",null,12,5]
[37022004,"Draaihals m/p (Biotoop)",null,12,5]

{"sheet":"Handleiding","index":2,"n_rows":93,"n_cols":8,"rows_kept":93,"merged":[[0,0,0,10],[1,0,1,10],[6,0,6,8],[7,0,7,8],[8,0,8,8],[9,2,9,8],[11,2,11,8],[14,2,14,8],[15,2,15,8],[16,2,16,8],[17,2,17,8],[18,2,18,8],[19,2,19,8],[22,2,22,10],[23,2,23,8],[25,2,25,8],[28,0,28,8],[29,0,29,10],[30,0,30,10],[34,0,34,10],[37,0,37,8],[38,0,38,8],[39,0,39,10],[40,0,40,10],[41,0,41,8],[42,0,42,8],[43,0,43,8],[46,0,46,8],[47,2,47,10],[48,2,48,8],[50,2,50,10],[51,2,51,10],[53,2,53,10],[54,2,54,8],[55,2,55,10],[56,2,56,10],[57,2,57,8],[58,2,58,8],[59,2,59,8],[61,2,61,8],[62,2,62,8],[64,2,64,8],[65,2,65,8],[67,2,67,8],[68,2,68,8],[70,2,70,8],[71,2,71,10],[72,2,72,8],[73,2,73,10],[74,2,74,8],[77,0,77,10]]}
["Handleiding invullen voor het Digitale Inschrijfformulier"]
["Wat moet u allemaal invullen om een zo'n compleet mogelijk inschrijfformulier in te leveren"]
[]
["Het Digitale inschrijfformulier is gemaakt om het voor u en uw TT-Secretaris zo gemakkelijk mogelijk te maken."]
["Er zijn diverse controles ingebouwd zodat u niets kunt vergeten om dit formulier goed in te kunnen vullen, succes."]
["LET OP! een APOSTROF ( ' ) mag in de tekstvakken niet gebruikt worden en een spatie is ook een karakter."]
[]
["NAW-gegevens"]
["Hieronder vul jij de diverse gevraagde gegevens in"]
["Kweeknummer:",":","Vul hier uw kweeknummer in (verplicht - 4 karakters)"]
["Ander C.O.M. nummer:",":","Vul hier een ander kweeknummer dan uw NBvV-kweeknummer in (niet verplicht - max.10 karakters)"]
["Achternaam:",":","Vul hier uw achternaam in (verplicht - max.28 karakters)"]
["Tussenvoegsel:",null,"Indien van toepassing vul hier uw tussenvoegsel in (indien van toepassing verplicht - max.8 karakters)"]
["Voorletters:",null,"Vul hier uw voorletters in (verplicht - max 7 karakters)"]
["Adres:",":","Vul hier uw adres in (verplicht - max.30 karakters)"]
["Postcode:",":","Vul hier uw postcode in (verplicht - max.7 karakters)"]
["Woonplaats:",":","Vul hier uw woonplaats in (verplicht - max.30 karakters)"]
["Telefoonnummer: ",":","Vul hier uw telefoonnummer in (verplicht - max.20 karakters)"]
["Mobielnummer: ",":","Vul hier uw mobielnummer in (verplicht - max.20 karakters)"]
["Lid afdeling: (code)",":","Vul hier de code van de vereniging in waar u lid van bent (verplicht - 3 karakters)"]
[null,null,"Als u de juiste code van uw vereniging heeft ingevuld verschijnt de naam en plaats van uw vereniging"]
[null,null,"Komt er \"Onbekend\" te staan is de verenigingscode waarschijnlijk fout. Probeer het opnieuw."]
["Lid Speciaalclub: (naam)",":","Vul hier de naam van de speciaalclub in waar u ook lid van bent (niet verplicht en indien gevraagd)"]
["Jeugdinzender: (Ja/Nee)",":","Vul hier \"Ja\" in als u een jeugdinzender bent (niet verplicht - Ja of Nee)"]
[null,null,"Maak hiervoor uw keuze in met de dropdownbox, welke rechts naast \"Jeugdinzender (Ja/Nee) zichtbaar is."]
["Geboortedatum:",":","Als uw \"Ja\" bij jeugdinzender hebt ingevuld moet jij uw geboortedatum invullen (alleen verplicht bij \"Ja\")"]
["Maak uw keuze:",":  Indien \"Maak uw keuze\" zichtbaar is kunt u in het vak rechts ernaast aangeven wat uw wens is."]
[null,null,"Maak hiervoor uw keuze in de dropdownbox, welke rechts naast \"Maak uw Keuze\" zichtbaar is."]
[]
["Als u het bovenstaande allemaal heeft ingevuld dan kunt u vervolgens uw vogels inschrijven welke u in wil zenden voor de "]
["tentoonstelling. U gebruik 1 regel per vogelsoort. Als U twee, of meer regels, gebruikt voor de zelfde klasse wordt het vakje"]
["waar u een klasse nummer hebt ingevoerd roze met rode letter. U moet dan vervolgens de teveel gebruikt regels met de zelfde"]
["klasse weghalen en bij de eerste van deze klasse de totalen aanpassen."]
["Als u iets ingevoerd hebt met te weinig of teveel karakters dan wordt het ingevoerde vakje roze. Verbetert dit vakje dan."]
["In de eerste kolom (A) wordt aangegeven of dat u de gevraagde gegevens correct heeft ingevoerd."]
["Omschrijving:",null,">>>"," is correct ingevoerd",null,null,">>>","is niet correct ingevoerd"]
[]
["Totaal inschrijfgeld"]
["Alle bedragen van het inschrijfgeld wordt automatisch ingevuld, op het bedrag \"Extra bijdrage\" na."]
["In het eerste gele vlak, achter \"Extra bijdrage\", kunt u een korte omschrijving neerzetten wat deze bijdrage voor"]
["bedoeld is. In het tweede gele vlak kunt u het extra bedrag in vullen."]
[]
["Mogen er foto's van uw vogels gemaakt worden"]
["Hier kunt u, doormiddel van \"Ja\" of \"Nee\", aangeven of dat er foto's van uw vogels gemaakt mogen worden"]
["De vogels kunnen hiervoor op een verantwoorde manier overgezet worden in een fotokast."]
[]
["Vogels gegevens invoeren"]
["Klasse",":","Hier vult u de klasse in van de vogel zoals aangegeven in het vraagprogramma."]
[null,null,"U tikt de klasse als volgt in 02001001 = zonder punten."]
[null,null,"De klasse-nummers moeten aansluitend ingevoerd (regel B24 t/m B52) worden, vergeet u een vakje wordt deze rood"]
["Soort-/ kleur van de vogels",":","Als u de juiste klasse heeft ingevoerd verschijnt in het vakje automatisch de soort-/kleur soortnaam van de"]
[null,null,"vogel. Wordt het vakje roze en staat er in het rood \"Onbekend\" dan komt dit nummer niet voor in het"]
[null,null,"vraagprogramma."]
["Soortkooi",":","Als u de juiste klasse heeft ingevoerd verschijnt in dit vakje automatisch het kooisoort-nummer welke u"]
[null,null,"u volgens het vraagprogramma van de N.B.v.V. moet gebruiken."]
["Aantal jaren",":","Als u de juiste klasse heeft ingevoerd verschijnt in de vakje automatisch het aantal jaren dat de vogel,"]
[null,null,"volgens het vraagprogramma van de N.B.v.V., als eigenkweek vogel mee mag doen."]
["Aantal Enkelingen",":","Hier vult u het aantal enkelingen in die u wilt inschrijven."]
["Aantal Stellen",":","Hier vult u het aantal stellen in die u wilt inschrijven (2 vogels = 1 stel)"]
[null,null,"Indien de in te vullen kolom grijs is en de cel rood wordt worden deze niet gevraagd op de tentoonstelling."]
[null,null,"U moet dan de getallen uit deze cellen verwijderen."]
["Aantal Stammen",":","Hier vult u het aantal stammen in die u wilt inschrijven (4 vogels = 1 stam)"]
[null,null,"Indien de in te vullen kolom grijs is en de cel rood wordt worden deze niet gevraagd op de tentoonstelling."]
[null,null,"U moet dan de getallen uit deze cellen verwijderen."]
["Aantal O.E.K.",":","Hier vult u het aantal Overjarig Eigenkweek vogels in die u wilt inschrijven."]
[null,null,"Indien de in te vullen kolom grijs is en de cel rood wordt worden deze niet gevraagd op de tentoonstelling."]
[null,null,"U moet dan de getallen uit deze cellen verwijderen."]
["Aantal O.K.",":","Hier vult u het aantal openklasse vogels in die u wilt inschrijven."]
[null,null,"Indien de in te vullen kolom grijs is en de cel rood wordt worden deze niet gevraagd op de tentoonstelling."]
[null,null,"U moet dan de getallen uit deze cellen verwijderen."]
["Verzekerings bedrag",":","Hier vult u het te verzekerde bedrag in van alle ingevulde vogels in deze regel."]
[null,null,"(voorbeeld: Dus heeft uj 4 enkelingen, 2 stellen, 1 stam ingevoerd betekend dit dat u"]
[null,null,"12 vogels heeft ingevoerd = 12 x € 25,00 = € 300,00."]
["Aantal huurkooien",":","Hier vult u het aantal kooien in welke u wilt huren van de organiserende vereniging."]
[null,null,"Indien de in te vullen kolom grijs is en de cel rood wordt als u een getal intikt worden er geen huurkooien"]
[null,null,"beschikbaargesteld. U moet dan de getallen uit deze cellen halen."]
[]
["Zoals u ziet zijn de onderste 5 regels helemaal geel. In deze regels kunt u vogels invoeren waar u geen klasse-nummer van weet of"]
["kunt vinden. Deze moet dan door de TT-secretaris opgezocht worden."]
[]
["E-mailadres"]
["E-mailadres",null,"Hier vult u uw E-mailadres in als ondertekening"]
[]
["Versturen"]
["Als u alles heeft ingevuld is het handig om dit formulier op te slaan op uw bureaublad voor dat u het gaat mailen naar het E-mailadres"]
["van de TT-secretaris van de organiseerde vereniging."]
["U kunt het beste uw kweeknummer en vervolgens uw achternaam geven aan het bestand."]
["Bijvoorbeeld: XXX Naam. (XXXX = Kweeknummer en Naam = achternaam) "]
["Als u het dan opgeslagen hebt op uw bureaublad kan u dit bestand versturen met uw E-mailprogramma naar de TT-Secretaris."]
[]
["Tabblad \"Vraagprogramma\""]
["In dit tabblad kunt u via een zoekfunctie het klasse-nummer vinden van de vogel die u wilt inschrijven."]
["Hoe deze functie werkt kunt u lezen in het tabblad \"Vraagprogramma\""]

{"sheet":"Verenigingen","index":3,"n_rows":457,"n_cols":20,"rows_kept":457,"merged":[[0,0,0,2],[0,4,0,6],[0,10,0,12],[38,5,38,12],[39,5,39,12],[40,5,40,12],[41,5,41,12],[42,5,42,12],[43,5,43,12],[44,5,44,12],[45,5,45,12],[46,5,46,12],[47,5,47,12],[49,5,49,12]]}
["Verenigingen",{"$nulls":3},"Speciaalclubs voor in het Dropdown menu",{"$nulls":5},"Speciaalclubs invoeren"]
["Ver.Code (3)","Prov.","Verenigingsnaam/plaats ",null,"R","Ver.Code (3)","Verenigingsnaam/plaats ",{"$nulls":3},"R","Ver.Code (3)","Verenigingsnaam/plaats ",{"$nulls":6},"Kampen 2"]
[{"$nulls":7},{"$f":"IF(F3=\"\",\"\",F3)","v":""},{"$nulls":11},"Oostermoer/Gorecht"]
[113,"GR","v.v. Oostermoer/Gorecht - Oostermoer/Gorecht",null,1,"NVT",{"$f":"IFERROR(VLOOKUP(F4,L$3:M$32,2,FALSE),\"\")","v":"N.V.T. Wordt niet gevraagd op deze TT"},{"$f":"IF(F4=\"\",\"\",UPPER(F4))","v":"NVT"},{"$f":"LEN(F4)","v":3},null,1,"NVT","N.V.T. Wordt niet gevraagd op deze TT",{"$f":"IF(L4=\"\",\"\",LEN(L4))","v":3},{"$nulls":5},"Schiphol"]
["218","UT","v.v. Kanaria I - Utrecht 1",null,2,"SEC","Spec.club Europese Cultuurvogels (SEC)",{"$f":"IF(F5=\"\",\"\",UPPER(F5))","v":"SEC"},{"$f":"LEN(F5)","v":3},null,2,"SAP","Spec.club Afrikaanse Prachtvinken (AP)",{"$f":"IF(L5=\"\",\"\",LEN(L5))","v":3},{"$nulls":5},"Utrecht 1"]
["219","UT","E.U.K.V. - Utrecht 2",null,3,null,"","",0,null,3,"IVV","Spec.club van Insecten- en Vruchtenetende Vogels (IVV)",3,{"$nulls":5},"Utrecht 2"]
["305","OV","De Hobbyfluiters - Delden",null,4,null,"","",0,null,4,"JMC","Spec.club Jap.meeuwen en overige lonchura's (JMC)",3,{"$nulls":5},"Delden"]
["308","GL","De Edelzanger   - Bennekom",null,5,null,"","",0,null,5,"SNG","Spec.club Natuurbroed Gouldamadine Ned.(SNGN)",3,{"$nulls":5},"Bennekom"]
["311","GL","v.v. Ons Genoegen - Didam 2",null,6,null,"","",0,null,6,"NKC","Ned.Kleurkanarie Club (NKC)",3,{"$nulls":5},"Didam 2"]
["319","OV","v.v. Ons Genoegen - Haaksbergen 2",null,7,null,"","",0,null,7,"MOZ","Ned.Speciaalclub Mozaiek Kanaries (MOZ)",3,{"$nulls":5},"Ede"]
["320","OV","Kanarie En Vogelver. Hattem - Hattem",null,8,null,"","",0,null,8,"NZC","Ned.Zebravinken Club (NZC)",3,{"$nulls":5},"Haaksbergen 2"]
["324","GL","v.v.De Gevleugelde Zanger\" - Lichtenvoorde",null,9,null,"","",0,null,9,"PSC","Parkieten Spec.club (PSC)",3,{"$nulls":5},"Hattem"]
["332","OV","v.v. Kleur En Zang - Oldenzaal 3",null,10,null,"","",0,null,10,"SCA","SC Austr.Prachtvinken & Papegaai Amadines (SCAP)",3,{"$nulls":5},"Lichtenvoorde"]
["334","GL","v.v. De Vogelvrienden - Doesburg 2",null,11,null,"","",0,null,11,"TIM","Spanish Timbrado Society (TIM)",3,{"$nulls":5},"Losser"]
["336","OV","Eerst Rijssense Kanariever. - Rijssen 3",null,12,null,"","",0,null,12,"SEC","Spec.club Europese Cultuurvogels (SEC)",3,{"$nulls":5},"Oldenzaal 3"]
["341","GL","v.v. De Gevleugelde Vrienden - Velp",null,13,null,"","",0,null,13,"SKN","Spec.club Kleurkanarie N-N (SKNN)",3,{"$nulls":5},"Doesburg 2"]
["342","GL","v.v.De Vogelvrienden   - Vorden",null,14,null,"","",0,null,14,"SCK","Spec.club Kleurkanaries (SCK)",3,{"$nulls":5},"Rijssen 3"]
["343","OV","Evkv Vriezenveen - Vriezenveen 2",null,15,null,"","",0,null,15,"HAR","Spec.club L.S.H. Harzers (HARZERS)",3,{"$nulls":5},"Apeldoorn 4"]
["350","GL","v.v.Vogelvreugd   - Zelhem",null,16,null,"","",0,null,16,"NPV","Spec.club Postuurkanaries NPV (NPV)",3,{"$nulls":5},"Velp"]
["358","OV","v.v. Onder Vrienden Opgericht - Zwolle 4",null,17,null,"","",0,null,17,"SWS","Spec.club Waterslagers \"De Nachtegaal\"  (WS)",3,{"$nulls":5},"Vorden"]
["402","LB","v.v.Exparka - Belfeld",null,18,null,"","",0,null,18,"ZHU","Spec.club Zangkanaries (NZHU)",3,{"$nulls":5},"Vriezenveen 2"]
["408","LB","v.v.Kleur En Vriendschap - Kerkrade 6",null,19,null,"","",0,null,19,"WAS","Werkgroep Amerikaanse Sijzen (WAS)",3,{"$nulls":5},"Zelhem"]
["409","LB","v.v. Leudal - Leudal",null,20,null,"","",0,null,20,"WPL","Werkgroep PLOCEIDAE (WP)",3,{"$nulls":5},"Zwolle 4"]
["420","LB","v.v. De Kollerclub - Heerlen 4",null,21,null,"","",0,null,21,null,null,"",{"$nulls":5},"Tolkamer"]
["421","LB","v.v. Uiterste Zuiden - Margraten",null,22,null,"","",0,null,22,null,null,"",{"$nulls":5},"Belfeld"]
["429","LB","De Vrolijk Veredelde Zangers - Maastricht 3",null,23,null,"","",0,null,23,null,null,"",{"$nulls":5},"Kerkrade 6"]
["430","LB","v.v.De Koningszangers - Koningsbosch",null,24,null,"","",0,null,24,null,null,"",{"$nulls":5},"Leudal"]
["432","LB","v.v.De Gevederde Vriend  - Reuver 2",null,25,null,"","",0,null,25,null,null,"",{"$nulls":5},"Elsloo 2"]
["440","LB","Kanarievereniging Sportkwekers - Spelholzerheide",null,26,null,"","",0,null,26,null,null,"",{"$nulls":5},"Brunssum 2"]
["442","LB","v.v. Zanglust - Stevensweert",null,27,null,"","",0,null,27,null,null,"",{"$nulls":5},"Heerlen 4"]
["448","LB","v.v.Kanarievrienden - Schin Op Geul",null,28,null,"","",0,null,28,null,null,"",{"$nulls":5},"Margraten"]
["450","LB","v.v.Ekvv 51 - Venlo 1",null,29,null,"","",0,null,29,null,null,"",{"$nulls":5},"Maastricht 3"]
["455","LB","E W VV Zang en Kleur - Weert 1",null,30,null,"","",0,null,30,null,null,"",{"$nulls":5},"Koningsbosch"]
["456","LB","v.v. Kawitro - Wessem",null,null,"▲  ▲  ▲",{"$nulls":5},"▲  ▲  ▲",{"$nulls":7},"Reuver 2"]
["460","LB","v.v. Barmsijs - Epen",{"$nulls":3}," << Betekend dat de code te kort of te lang is",{"$nulls":5}," << Betekend dat de code te kort of te lang is",{"$nulls":6},"Spelholzerheide"]
["461","LB","v.v. Boshoven - Weert 2",{"$nulls":3},"      regel 1 t/m 30 (max. 3 karakters in Hoofdletters)",{"$nulls":5},"      regel 21 t/m 30 (max. 3 karakters in Hoofdletters)",{"$nulls":6},"Stevensweert"]
["462","LB","v.v. De Gevleugelde Vrienden - Wanssum",{"$nulls":3},"<< Betekend dat deze code al in de lijst voorkomt.",{"$nulls":5},"<< Betekend dat deze code al in de lijst voorkomt.",{"$nulls":6},"Schin Op Geul"]
["473","LB","v.v. Echt En Omstreken - Echt 2",{"$nulls":16},"Venlo 1"]
["474","LB","v.v. Het Roerdal - Herkenbosch",null,null,"Als u de Dropdown menu \"Lid Speciaalclub (naam)\" wilt gebruiken moet u de gewenste code in de kolom E (regel 1 t/m 30) hier invullen.",{"$nulls":13},"Weert 1"]
["505","GL","v.v. Vogelvrienden  - Weurt",null,null,"De kolom F (regel 1 t/m 30) wordt dan automatisch gevuld met de speciaalclubsnaam als deze in de \"Speciaalclubs invoeren\" staat.",{"$nulls":13},"Wessem"]
["507","OB","v.v. Kanexo   - Deurne",null,null,"Als er dus geen naam verschijnt staat deze speciaalclub nog niet in de lijst \"Speciaalclubs invoeren\" en moet u deze dus nog toevoegen aan deze lijst",{"$nulls":13},"Epen"]
["508","WB","v.v.Vogellust - Tilburg 9",null,null,"Hiervoor zijn nog 10 regels (regel 21 t/m 30) beschikbaar. In kolom K, regel 21 t/m 30 vult u een code in (3 karakters in Hoofdletters) en in kolom L,  ",{"$nulls":13},"Weert 2"]
["521","OB","v.v. Vogelvreugd - Nistelrode 2",null,null,"regel 21 t/m 30 vult u de naam van de speciaalclub in.",{"$nulls":13},"Wanssum"]
["529","WB","v.v. De Vogelvriend - Sprang-Capelle",null,null,"Als u de speciaalclub aan de lijst \"Speciaalclubs invoeren\" heeft toegevoegd kunt u de code in de lijst \"Speciaalclubs voor in Dropdown menu\" ",{"$nulls":13},"Wijlre"]
["541","OB","v.v. Vogelvreugd - Dinther",null,null,"Alle speciaalcodes welke in de lijst \"Speciaalclubs voor in het Dropdown menu\" staan worden nu in de Dropdownbox \"Lid Speciaalclub (naam)\" in het tabblad",{"$nulls":13},"Geleen 3"]
["A02","OB","v.v. De Edelzanger - Aalst Waalre",null,null," Inschrijfformulier getoond en dan kunnen de inzenders uit deze lijst kiezen voor welke speciaalclub zij mee willen spelen in het klassement \"Speciaalclubs\"",{"$nulls":13},"Echt 2"]
["A06","GL","v.v. Het Bonte Boertje - Aalst",null,null,"Als u tijdens u tentoonstelling dit klassement niet heeft dan zet u in de lijst \"Speciaalclubs voor in het Dropdown menu\" in kolom E, regel 1 NVT ",{"$nulls":13},"Herkenbosch"]
["A08","ZH","v.v. Vogelvrienden  - Ammerstol Bergambacht Eo",null,null,"en haalt u de ander code's weg.",{"$nulls":13},"Weurt"]
["A09","ZL","v.v. Zanglust - Arnemuiden",{"$nulls":16},"Deurne"]
["A12","GL","v.v. Kanaria - Apeldoorn 1",null,null,"LET OP! De gegevens van de speciaalclubs moet wel ingevoerd worden in het TT-Programma in het onderdeel \"Verenigingen\".",{"$nulls":13},"Tilburg 9"]
["A15","OV","v.v. De Goudvink - Almelo 2",{"$nulls":16},"Nistelrode 2"]
["A18","NH","v.v. Pracht En Praal - Akersloot",{"$nulls":16},"Sprang-Capelle"]
["A20","ZH","v.v. Ons Genoegen - Ameide",{"$nulls":16},"Dinther"]
["A25","NH","v.v. Pakawitro - Anna Paulowna",{"$nulls":16},"Aalst"]
["A28","OB","v.v. Zang En Kleur - Asten",{"$nulls":16},"Alkmaar"]
["A30","WB","v.v. Alfauna - Alphen",{"$nulls":16},"Almelo I"]
["A31","WB","v.v. De Rietzanger - Almkerk",{"$nulls":16},"Aalst"]
["A32","OB","v.v. Klezatro - St Anthonis",{"$nulls":16},"Ammerstol Bergambacht Eo"]
["A35","ZL","v.v. De Edelzanger - Aardenburg",{"$nulls":16},"Arnemuiden"]
["A36","GR","v.v. Kweeklust  - Aduard",{"$nulls":16},"Apeldoorn 1"]
["A39","NH","1e. Ver. Van Vogelvrienden - Almere",{"$nulls":16},"Almelo 2"]
["B01","UT","v.v. Gooi En Eemland - Baarn",{"$nulls":16},"Akersloot"]
["B02","GL","v.v. Vogelvreugd - Beekbergen Loenen",{"$nulls":16},"Ameide"]
["B03","WB","v.v. De Gekleurde Zanger - Bergen Op Zoom",{"$nulls":16},"Anna Paulowna"]
["B04","NH","v.v. Vogelvreugd - Beverwijk",{"$nulls":16},"Asten"]
["B05","ZH","v.v. Zang En Kleur  - Boskoop",{"$nulls":16},"Apeldoorn 2"]
["B07","WB","v.v. Bredase Vogelvrienden - Breda 1",{"$nulls":16},"Alphen"]
["B08","OB","v.v.  De Goudvink Bergeijk - Bergeijk",{"$nulls":16},"Almkerk"]
["B09","OB","v.v. De Vogelvriend - Best",{"$nulls":16},"St Anthonis"]
["B13","OB","v.v. Ons Ideaal - Boxtel 1",{"$nulls":16},"Apeldoorn 3"]
["B14","LB","v.v. De Vogelvrienden  - Bocholtz",{"$nulls":16},"Aardenburg"]
["B15","GL","v.v. De Edelzanger - Brummen",{"$nulls":16},"Aduard"]
["B18","ZH","v.v. De Vogelvriend - Berkel",{"$nulls":16},"Axel"]
["B22","NH","v.v. Kds Broek In Waterland - Broek In Waterland",{"$nulls":16},"Almere"]
["B25","GR","v.v.Vogelvreugd - Bellingwolde",{"$nulls":16},"Baarn"]
["B44","FR","v.v.  Beo - Bolsward",{"$nulls":16},"Beekbergen Loenen"]
["B45","DR","v.v. De Hondsrug - Borger",{"$nulls":16},"Bergen Op Zoom"]
["B58","UT","v.v. De Bilt/Bilthoven - De Bilt/Bilthoven",{"$nulls":16},"Beverwijk"]
["C01","DR","v.v. Vogelvreugd - Coevorden",{"$nulls":16},"Boskoop"]
["C02","ZL","v.v. De Vlaamsegaai - Clinge",{"$nulls":16},"Breda 1"]
["D01","OV","v.v. De Gekleurde Zanger - Deventer 1",{"$nulls":16},"Bergeijk"]
["D05","ZH","v.v. De Voliere - Dordrecht",{"$nulls":16},"Best"]
["D08","FR","v.v. De Woudzangers - Drogeham",{"$nulls":16},"Boxtel 1"]
["D11","OV","v.v. Witroka - Denekamp",{"$nulls":16},"Bocholtz"]
["D14","OV","v.v. De Gieteling - Dedemsvaart",{"$nulls":16},"Brummen"]
["D17","FR","v.v. Drachtser Vogelvrienden - Drachten",{"$nulls":16},"Berkel"]
["D19","FR","v.v. Zang En Kleur - Dokkum",{"$nulls":16},"Bargercompascuum"]
["D21","ZL","v.v. De Vogelliefhebbers Walcheren - Veere",{"$nulls":16},"Broek In Waterland"]
["D26","DR","v.v. Volierevrienden  - Diever Eo",{"$nulls":16},"Bellingwolde"]
["D28","OB","v.v. De Edelzanger - Drunen",{"$nulls":16},"Beilen"]
["D33","GR","v.v. Eemsmond - Delfzijl Eo",{"$nulls":16},"Bolsward"]
["D34","DR","v.v. Vogellust - Dalerpeel",{"$nulls":16},"Borger"]
["D37","WB","v.v. The Little Birds - Dongen",{"$nulls":16},"Boekel"]
["D40","GL","Ned.Forpussenclub - Didam",{"$nulls":16},"Bosschenhoofd"]
["D42","GL","v.v. Witropaka - Duiven 2",{"$nulls":16},"Brunssum"]
["D45","GL","PSC Zuid Oost Nederland - Didam 2",{"$nulls":16},"De Bilt/Bilthoven"]
["E01","GL","v.v. De Vogelvriend  - Elburg",{"$nulls":16},"Coevorden"]
["E07","GL","v.v. Tot Ons Genoegen - Eerbeek",{"$nulls":16},"Clinge"]
["E10","DR","v.v. De Vogelvrienden Cresendo - Emmercompascuum",{"$nulls":16},"Deventer 1"]
["E13","GL","v.v. Vogellust - Elst",{"$nulls":16},"Dinteloord"]
["E14","OB","v.v. Aviarium - Eindhoven 2",{"$nulls":16},"Dordrecht"]
["E19","OV","v.v. Vogelvreugd - Ens",{"$nulls":16},"Drogeham"]
["E25","OB","v.v. De Kleurkanarie - Eindhoven 5",{"$nulls":16},"Denekamp"]
["E28","OV","v.v. De Oostvogels - Enschede 3",{"$nulls":16},"Dedemsvaart"]
["E30","OB","v.v. Stratum - Eindhoven 6",{"$nulls":16},"Drachten"]
["E32","OB","v.v. De Edelzanger - Erp",{"$nulls":16},"Delft 2"]
["E38","OB","v.v. Vogelvriend De Leeuwerik - Eersel-Steensel",{"$nulls":16},"Dokkum"]
["F02","WB","v.v. De Polderzangers - Fijnaart",{"$nulls":16},"Veere"]
["F03","FR","v.v. De Nachtegaal - Ferwerd",{"$nulls":16},"Diever Eo"]
["G03","ZH","v.v. Midden Holland - Gouda/Reeuwijk",{"$nulls":16},"Drunen"]
["G04","OV","v.v. De Goudvink - Glanerbrug I",{"$nulls":16},"Delfzijl Eo"]
["G05","ZH","Eerste Flakkeese Vogelver. - Middelharnis",{"$nulls":16},"Dalerpeel"]
["G08","WB","v.v. De Goudvink  - Gilze",{"$nulls":16},"Dongen"]
["G09","OB","v.v. De Nachtegaal - Gemert",{"$nulls":16},"Didam"]
["G15","ZL","v.v. De Vogelvrienden  - Goes",{"$nulls":16},"Duiven 2"]
["G16","ZH","v.v. De Edelzanger - Groot Ammers",{"$nulls":16},"Didam 2"]
["G17","GR","v.v. Onze Vogels Westerkwartier - Grootegast",{"$nulls":16},"Elburg"]
["G19","DR","v.v. Gieten  - Gieten",{"$nulls":16},"Epe"]
["G20","OV","v.v. Vogellust - Genemuiden",{"$nulls":16},"Erica"]
["G22","FR","v.v. Grou - Grouw",{"$nulls":16},"Eerbeek"]
["G24","GL","v.v. Onder Ons - Gendt 2",{"$nulls":16},"Emmercompascuum"]
["G29","ZH","v.v. Gorinchem E.O. - Gorinchem",{"$nulls":16},"Elst"]
["G30","GL","v.v. De Gekleurde Zanger - Groesbeek 2",{"$nulls":16},"Eindhoven 2"]
["G31","LB","Kan.Ver. De Rietvink - Geleen 2",{"$nulls":16},"Ens"]
["G32","ZH","v.v. De Goudvink - Gouderak",{"$nulls":16},"Eindhoven 5"]
["G35","WB","v.v. De Distelvink - Goirle",{"$nulls":16},"Enschede 3"]
["G36","OB","v.v. Zang En Kleur - Geffen",{"$nulls":16},"Eindhoven 6"]
["H02","ZH","v.v. De Kleurkanarie - Den Haag 2",{"$nulls":16},"Erp"]
["H05","GL","v.v. De Martel - Huissen",{"$nulls":16},"Eersel-Steensel"]
["H06","NH","v.v. Vogelvreugd - Huizen",{"$nulls":16},"Franeker"]
["H09","LB","v.v. Ons Genoegen - Horst",{"$nulls":16},"Fijnaart"]
["H10","FR","v.v. Introka - Harlingen",{"$nulls":16},"Ferwerd"]
["H12","NH","v.v. Kanaria - Den Helder 1",{"$nulls":16},"Gouda/Reeuwijk"]
["H15","WB","v.v. Zuid West Hoek - Hoogerheide 1",{"$nulls":16},"Glanerbrug I"]
["H18","ZH","v.v. Vogelvreugd - Hardinxveld Giessendam 1",{"$nulls":16},"Middelharnis"]
["H20","OB","v.v. De Tuinfluiter - Haaren",{"$nulls":16},"Gilze"]
["H22","OV","v.v. De Vogelvriend - Hasselt",{"$nulls":16},"Gemert"]
["H26","OV","v.v. Kleur En Fleur - Den Ham",{"$nulls":16},"Goes"]
["H28","ZH","v.v. De Vogelvriend - Hellevoetsluis",{"$nulls":16},"Groot Ammers"]
["H31","OV","v.v. Vogelvrienden - Hardenberg",{"$nulls":16},"Grootegast"]
["H40","GR","v.v. Onze Gevleugelde Vrienden - Hoogkerk",{"$nulls":16},"Gieten"]
["H43","GL","v.v. Exokan - Hengelo",{"$nulls":16},"Genemuiden"]
["H47","NH","v.v.Tropica - Heemskerk",{"$nulls":16},"Grouw"]
["H49","LB","v.v. Onze Hobby - Heythuizen",{"$nulls":16},"Gendt 2"]
["H51","OB","v.v. Het Pareltje - Heeze",{"$nulls":16},"Gorinchem"]
["H53","DR","v.v. Fauna - Hoogeveen 1",{"$nulls":16},"Groesbeek 2"]
["H55","NH","v.v. Huygen Fauna - Heerhugowaard",{"$nulls":16},"Geleen 2"]
["H62","GL","Vogelhoudersver.De Vriendschap - Heerde",{"$nulls":16},"Gouderak"]
["H63","OB","v.v. Helmonds Kleur'56 - Helmond 1",{"$nulls":16},"Goirle"]
["H64","OV","Penn. v.v. Etkv.  P.J. Helder - Hengelo 2",{"$nulls":16},"Geffen"]
["H66","GL","v.v. Harderwijker Vogelliefhebbers - Harderwijk 1",{"$nulls":16},"Den Haag 1"]
["H68","UT","v.v. Sportkwekers - Hoogland",{"$nulls":16},"Den Haag 2"]
["H71","OB","v.v. Vogelliefde   - Hapert",{"$nulls":16},"Huissen"]
["H72","UT","v.v. Vogelvreugd - Houten",{"$nulls":16},"Huizen"]
["H79","ZH","v.v. De Nachtegaal - Heerjansdam",{"$nulls":16},"Horst"]
["H80","NH","v.v. Kleurenpracht - Heiloo",{"$nulls":16},"Harlingen"]
["H85","GL","v.v. De Kolibrie - Heumen Malden",{"$nulls":16},"Den Helder 1"]
["H87","OB","v.v. De Goudvink - Herpen",{"$nulls":16},"Hoogerheide 1"]
["J01","FR","v.v. Vol. Ver. Zanglust - Joure",{"$nulls":16},"Hardinxveld Giessendam 1"]
["J02","FR","v.v. Fugelwille  - Jubbega",{"$nulls":16},"Haaren"]
["J04","LB","v.v. De Grensvogels - Ittervoort",{"$nulls":16},"Hasselt"]
["K01","ZH","v.v. De Kanarievogel - Katwijk",{"$nulls":16},"Den Ham"]
["K02","DR","v.v. Klazienaveen E.O. - Klazienaveen",{"$nulls":16},"Hellevoetsluis"]
["K04","ZH","v.v. De Vogelvrienden - Krimpen A/D Ijssel",{"$nulls":16},"Hardenberg"]
["K05","ZH","v.v. Vogelvreugd - Krimpen A/D Lek",{"$nulls":16},"Hoogkerk"]
["K06","ZH","v.v. Vogelvreugd - Koudekerk Hazerswoude",{"$nulls":16},"Hengelo"]
["K08","ZL","v.v. Zang En Kleur - Kapelle Biezelinge",{"$nulls":16},"Haps 4"]
["K09","GL","v.v. De Drielse Voliere - Kerkdriel",{"$nulls":16},"Heemskerk"]
["K11","ZL","v.v. Zang En Kleur - Kloosterzande",{"$nulls":16},"Heythuizen"]
["K12","ZL","v.v. Krabbendijke  - Krabbendijke",{"$nulls":16},"Heeze"]
["K14","LB","v.v. De Vogelvrienden - Kunrade",{"$nulls":16},"Hoogeveen 1"]
["K15","FR","v.v. Zuidwest Hoeke - Koudum",{"$nulls":16},"Heerhugowaard"]
["K18","OV","v.v. De Voliere - Kampen",{"$nulls":16},"Heerde"]
["L10","FR","v.v. Lemster Vogelvrienden - Lemmer",{"$nulls":16},"Helmond 1"]
["L13","OV","v.v. Ons Genoegen - Lettele",{"$nulls":16},"Hengelo 2"]
["L16","ZH","v.v. Vogelvriend  - Leerdam",{"$nulls":16},"Harderwijk 1"]
["L17","NH","v.v. De Streker Vogelvrienden - Lutjebroek",{"$nulls":16},"Hoogland"]
["L18","OB","v.v. De Vogelvrienden - Leende",{"$nulls":16},"Hapert"]
["L19","OV","v.v. De Gekleurde Zanger - Lochem",{"$nulls":16},"Houten"]
["L23","OB","v.v. De Notenkraker - Liempde",{"$nulls":16},"Heerjansdam"]
["L25","FR","v.v. Leeuwarder Vogelvrienden - Leeuwarden 2",{"$nulls":16},"Heiloo"]
["L28","UT","v.v. De Voliere - Leersum",{"$nulls":16},"Heumen Malden"]
["L29","UT","v.v. De Vogelvrienden Leusden - Leusden",{"$nulls":16},"Herpen"]
["L35","GL","v.v. Vogel-Eiland - Lobith",{"$nulls":16},"Hoorn"]
["L36","OB","v.v. Laarbeek - Laarbeek",{"$nulls":16},"Joure"]
["M02","DR","v.v. Vogelweelde  - Meppel",{"$nulls":16},"Jubbega"]
["M03","UT","v.v. Pakara - Maarn",{"$nulls":16},"St Jansklooster"]
["M04","OB","v.v. De Nachtegaal - Middelrode/Berlicum",{"$nulls":16},"Ittervoort"]
["M06","GR","v.v. Musselkanaal E.O. - Musselkanaal",{"$nulls":16},"Katwijk"]
["M08","LB","v.v. De Edelzanger - Munstergeleen 1",{"$nulls":16},"Klazienaveen"]
["M10","WB","v.v. Moerdijkse Vogelvrienden - Moerdijk",{"$nulls":16},"Klundert"]
["M11","NH","v.v. De Kwartel - Muiden",{"$nulls":16},"Krimpen A/D Ijssel"]
["M13","OB","v.v. De Beerse Vogelvrienden - Middelbeers",{"$nulls":16},"Krimpen A/D Lek"]
["M14","FR","v.v. Fugelnocht - Damwoude En Omstreken",{"$nulls":16},"Koudekerk Hazerswoude"]
["M17","ZH","Maaslandse Vogelvereniging - Maasland",{"$nulls":16},"Kapelle Biezelinge"]
["M19","WB","v.v. EMKV - Made 2",{"$nulls":16},"Kerkdriel"]
["M20","LB","v.v. Meijels Pracht - Meyel",{"$nulls":16},"Kloosterzande"]
["M23","GL","v.v. De Kwieke Kwekers - Meteren",{"$nulls":16},"Krabbendijke"]
["M30","OB","v.v. De Goudvink - Maarheeze",{"$nulls":16},"Kunrade"]
["M35","UT","v.v. Hollandse Ijssel - Montfoort",{"$nulls":16},"Koudum"]
["M36","GR","v.v. Oost Groningen - Menterwolde",{"$nulls":16},"Kampen"]
["M37","LB","v.v. Midden Limburg - Midden Limburg",{"$nulls":16},"Lemmer"]
["N01","DR","v.v. Ons Genoegen - Nieuw Amsterdam",{"$nulls":16},"Lettele"]
["N05","GL","ENVV - Nijmegen 1",{"$nulls":16},"Leerdam"]
["N06","OV","v.v. Zang En Kleur - Nijverdal Hellendoorn",{"$nulls":16},"Lutjebroek"]
["N09","ZL","v.v. De Nachtegaal  - Nieuw Namen",{"$nulls":16},"Leende"]
["N12","NH","v.v. De Vogelvriend - Amstelveen",{"$nulls":16},"Lochem"]
["N16","ZH","v.v. De Kolibrie - Noordwijkerhout",{"$nulls":16},"Liempde"]
["N26","OB","v.v. De Nachtegaal - Nuland",{"$nulls":16},"Leeuwarden 2"]
["N30","FR","v.v. Zanglust - Noordbergum",{"$nulls":16},"Lunteren"]
["N31","GL","v.v. Borculo-Neede Eo - Neede",{"$nulls":16},"Leersum"]
["N33","GL","v.v. De Vogelvriend  - Nijkerk",{"$nulls":16},"Leusden"]
["N34","OB","v.v. De Bastaard - Nuenen",{"$nulls":16},"Lobith"]
["N37","OV","v.v. De Volierevriend - Nieuw Leusen",{"$nulls":16},"Laarbeek"]
["N39","NH","v.v. De Meervogels - Nieuw Vennep",{"$nulls":16},"Meppel"]
["N41","ZH","v.v. 'T Sijsje - Nieuwveen",{"$nulls":16},"Maarn"]
["O01","WB","v.v. Avis Amicitia - Oud Gastel 2",{"$nulls":16},"Middelrode/Berlicum"]
["O02","GL","v.v. Zang En Kleur - Opheusden",{"$nulls":16},"Musselkanaal"]
["O05","OV","v.v. De Vogelvrienden - Oldenzaal 1",{"$nulls":16},"Mill"]
["O13","OB","v.v. Rooyse Vogelvreugd - Sint Oedenrode",{"$nulls":16},"Munstergeleen 1"]
["O16","GL","v.v. Vogelvreugd - Oldebroek",{"$nulls":16},"Moerdijk"]
["O18","ZH","v.v. De Siervogel - Oostvoorne",{"$nulls":16},"Muiden"]
["O20","GL","v.v. O.V.L - Ochten",{"$nulls":16},"Middelbeers"]
["O22","OV","v.v. De Tuinfluiter - Ommen",{"$nulls":16},"Damwoude En Omstreken"]
["O24","OV","v.v. Ons Genoegen - Olst-Wijhe",{"$nulls":16},"Maasland"]
["O27","OV","v.v. Florissant - Oldenzaal 2",{"$nulls":16},"Made 2"]
["O30","GL","v.v. Kantropa - Oosterhout",{"$nulls":16},"Meyel"]
["O34","OV","v.v. Ootmarsum - Ootmarsum",{"$nulls":16},"Meteren"]
["O35","ZL","v.v. De Vogelvrienden  - Oud Vossemeer",{"$nulls":16},"Maarheeze"]
["O36","NH","v.v. Opmeer-Spanbroek - Opmeer Spanbroek",{"$nulls":16},"Montfoort"]
["P09","GL","v.v.  De Putter - Putten",{"$nulls":16},"Menterwolde"]
["P11","WB","v.v. Privo - Prinsenbeek",{"$nulls":16},"Midden Limburg"]
["R01","DR","v.v. De Vogelvriend - Roden",{"$nulls":16},"Nieuw Amsterdam"]
["R02","WB","v.v. De Natuur En Vogelvrienden - Roosendaal 1",{"$nulls":16},"Nijmegen 1"]
["R04","OB","v.v. Zang En Kleur - Reusel",{"$nulls":16},"Nijverdal Hellendoorn"]
["R06","OV","v.v. Zanglust - Rijssen 1",{"$nulls":16},"Nieuw Namen"]
["R07","UT","v.v. De Kleurvogel - Rhenen",{"$nulls":16},"Amstelveen"]
["R08","WB","v.v. De Vogelvriend - Rijsbergen",{"$nulls":16},"Nieuwkoop"]
["R09","WB","v.v. De Edelzanger - Roosendaal 2",{"$nulls":16},"Nieuw Lekkerland"]
["R11","OB","v.v. De Nachtegaal - Rosmalen",{"$nulls":16},"Noordwijkerhout"]
["R13","WB","v.v. E.R.V. - Rijen",{"$nulls":16},"Nieuwstadt"]
["R14","ZH","v.v. De Diamantvink - Roelofarendsveen",{"$nulls":16},"Nuland"]
["R25","DR","v.v. Bosfluiters   - Rolde",{"$nulls":16},"Noordbergum"]
["R27","WB","v.v. De Vogelvriend - Rucphen",{"$nulls":16},"Neede"]
["R28","WB","v.v. Vogellust - Raamsdonksveer",{"$nulls":16},"Nijkerk"]
["R32","WB","v.v. Riel - Riel",{"$nulls":16},"Nuenen"]
["R35","ZH","v.v. Rijnmond - Rotterdam 5",{"$nulls":16},"Nieuw Leusen"]
["R37","LB","v.v. Huisvriend - Rothem Meerssen",{"$nulls":16},"Nieuw Vennep"]
["R38","LB","v.v. Onze Zangers - Roermond",{"$nulls":16},"Nieuwveen"]
["R40","ZH","v.v. Witroka - Ridderkerk",{"$nulls":16},"Oud Gastel 2"]
["R45","ZH","v.v. Vogels En Vriendschap - Rotterdam 7",{"$nulls":16},"Opheusden"]
["S03","UT","v.v. Soester Vogelvrienden - Soest 1",{"$nulls":16},"Oldenzaal 1"]
["S05","ZH","v.v. De Vogelvriend - Sliedrecht",{"$nulls":16},"Sint Oedenrode"]
["S06","ZH","v.v. Spijkenisse E.O. - Spijkenisse 1",{"$nulls":16},"Oldebroek"]
["S15","OV","v.v. Steenwijk E.O. - Steenwijk 1",{"$nulls":16},"Oostwold"]
["S20","LB","v.v. Onze Vogels - Sittard 2",{"$nulls":16},"Oostvoorne"]
["S23","OB","v.v. Fenix - Schijndel",{"$nulls":16},"Ochten"]
["S25","FR","v.v. Schagen E.O. - Schagen",{"$nulls":16},"Ommen"]
["S27","LB","v.v. 'T Sieske - Stein",{"$nulls":16},"Olst-Wijhe"]
["S36","UT","v.v. Vogelvreugde - Spakenburg",{"$nulls":16},"Oldenzaal 2"]
["S38","DR","v.v. De Vogelvrienden - Smilde",{"$nulls":16},"Oosterhout"]
["S39","OV","v.v. De Edelzanger - Steenwijkerwold",{"$nulls":16},"Ootmarsum"]
["S43","LB","v.v. De Geelgors - Stramproy",{"$nulls":16},"Oud Vossemeer"]
["S44","GL","v.v. Vios - Swifterbant",{"$nulls":16},"Opmeer Spanbroek"]
["T03","ZL","v.v. Vogelvreugd - Tholen",{"$nulls":16},"Olst- Diepenveen"]
["T07","GL","v.v. Tielse Vogelliefhebbers - Tiel",{"$nulls":16},"Putten"]
["T08","OV","v.v. Vooster Vogelvrienden - Twello 1",{"$nulls":16},"Prinsenbeek"]
["T11","WB","v.v. Voliere Vrienden - Teteringen",{"$nulls":16},"Roden"]
["T12","ZL","v.v. De Vogelvrienden    - Terneuzen",{"$nulls":16},"Roosendaal 1"]
["T15","OV","v.v. Tubbergen - Tubbergen",{"$nulls":16},"Reusel"]
["T21","WB","v.v. Opo Free - Tilburg 6",{"$nulls":16},"Renswoude"]
["T22","WB","v.v. Hart Van Brabant - Tilburg 7",{"$nulls":16},"Rijssen 1"]
["U01","OB","v.v. Avicultura - Uden",{"$nulls":16},"Rhenen"]
["U02","GL","v.v. De Vogelvreugde - Ulft",{"$nulls":16},"Rijsbergen"]
["U04","OV","v.v. De Vogelvrienden - Urk",{"$nulls":16},"Roosendaal 2"]
["U09","NH","v.v. De Groenling   - De Kwakel",{"$nulls":16},"Rosmalen"]
["V01","OB","v.v. De Voliere - Valkenswaard 1",{"$nulls":16},"Rijen"]
["V03","GR","v.v. De Vogelvriend - Veendam",{"$nulls":16},"Roelofarendsveen"]
["V04","ZH","v.v. Icarus - Vlaardingen",{"$nulls":16},"Rolde"]
["V06","UT","v.v. De Veenendaalse Vogelvrienden - Veenendaal",{"$nulls":16},"Rilland Bath"]
["V07","OB","v.v. Veldhoven 1 - Veldhoven 1",{"$nulls":16},"Rucphen"]
["V08","GL","v.v. De Cannenburgh - Vaassen",{"$nulls":16},"Raamsdonksveer"]
["V11","OB","v.v. De Vogelvriend - Veghel 1",{"$nulls":16},"Riel"]
["V17","OV","v.v. De Waterslager - Vollenhove",{"$nulls":16},"Rotterdam 5"]
["V18","OB","v.v. De Goudvink - Vught 2",{"$nulls":16},"Rothem Meerssen"]
["V21","UT","v.v. De Vogelvriend - Nieuwegein",{"$nulls":16},"Roermond"]
["V23","NH","v.v. De Spotvogel - Volendam",{"$nulls":16},"Ridderkerk"]
["V32","GL","v.v. Kweeklust - Voorthuizen",{"$nulls":16},"Rotterdam 7"]
["V35","OV","v.v. Vogelvreugd - Vriezenveen Westerhaar",{"$nulls":16},"Schiedam"]
["W01","WB","v.v. De Sijs - Waalwijk 1",{"$nulls":16},"Soest 1"]
["W03","ZH","v.v. Westland - Westland  Naaldwijk",{"$nulls":16},"Sliedrecht"]
["W04","WB","v.v. De Gekleurde Zanger - Sint Willebrord",{"$nulls":16},"Spijkenisse 1"]
["W06","ZH","v.v. Avicultura - Woerden",{"$nulls":16},"Schildwolde"]
["W07","GL","v.v. De Goudvink - Wijchen",{"$nulls":16},"Stiens"]
["W12","GL","v.v.Tropenlust - Wehl",{"$nulls":16},"Steenwijk 1"]
["W13","ZH","v.v. De Gouldamadine - Wormerveer",{"$nulls":16},"Sittard 2"]
["W14","GR","v.v. De Vogelvriend - Winschoten 1",{"$nulls":16},"Schijndel"]
["W16","GR","Vol. Ver. 'T Hoogeland - Warffum  Uithuizen",{"$nulls":16},"Schaijk"]
["W19","ZL","v.v. De Schouwse Zanger - Westerschouwen",{"$nulls":16},"Schagen"]
["W21","OB","v.v. Wintelre - Wintelre",{"$nulls":16},"Stein"]
["W25","OV","v.v. Vogelvreugd - Wierden",{"$nulls":16},"Surhuisterveen"]
["W26","WB","1e Wagenbergse v.v. - Wagenberg",{"$nulls":16},"Spakenburg"]
["W29","GL","v.v. De Vogelvriend - Wezep",{"$nulls":16},"Smilde"]
["W31","GR","v.v. De Kardinaal - Woltersum",{"$nulls":16},"Steenwijkerwold"]
["W35","UT","v.v. Zang En Kleur - Woudenberg",{"$nulls":16},"Stramproy"]
["W36","GL","1e Winterswijkse Kleurvogel Ve - Winterswijk",{"$nulls":16},"Swifterbant"]
["W38","WB","v.v. De Bastaard - Wouw",{"$nulls":16},"Tholen"]
["Y01","UT","v.v. Kleur En Zang - Ijsselstein",{"$nulls":16},"Tiel"]
["Y02","ZL","v.v. Vogelvreugd 79 - Ijzendijke",{"$nulls":16},"Twello 1"]
["Y04","ZL","v.v. Interscaldis - Yerseke",{"$nulls":16},"Tilburg 2"]
["Z01","ZH","v.v. De Vogelvriend - Zoetermeer",{"$nulls":16},"Teteringen"]
["Z05","WB","v.v. De Edelzanger - Zundert",{"$nulls":16},"Terneuzen"]
["Z06","GL","v.v. Zanglust - Zutphen",{"$nulls":16},"Tubbergen"]
["Z07","OV","v.v. De Volierevriend - Zwolle 2",{"$nulls":16},"Tilburg 6"]
["Z12","OV","v.v.De Edelzanger  - Zwartsluis",{"$nulls":16},"Tilburg 7"]
["Z14","FR","v.v. De Fugelfreonen - Zwaagwesteinde",{"$nulls":16},"Uden"]
["Z15","NH","v.v. Haarlemmermeer   - Haarlemmermeer",{"$nulls":16},"Ulft"]
["Z16","DR","v.v. Zanglust   - Zuidwolde",{"$nulls":16},"Urk"]
["Z17","GL","v.v. De Edelzangers - Zaltbommel",{"$nulls":16},"Ureterp"]
["Z18","WB","v.v. Zanglust - Zevenbergen 1",{"$nulls":16},"De Kwakel"]
["Z19","OB","v.v. Kleur En Zang  - Zeeland",{"$nulls":16},"Valkenswaard 1"]
["Z23","DR","v.v. Ons Eigen Kweek - Zwartemeer",{"$nulls":16},"Veendam"]
["Z25","ZH","v.v. Zang En Kleur - Zevenhuizen",{"$nulls":16},"Vlaardingen"]
[{"$nulls":19},"Veenendaal"]
[{"$nulls":19},"Veldhoven 1"]
[{"$nulls":19},"Vaassen"]
[{"$nulls":19},"Veghel 1"]
[{"$nulls":19},"Vollenhove"]
[{"$nulls":19},"Vught 2"]
[{"$nulls":19},"Nieuwegein"]
[{"$nulls":19},"Volendam"]
[{"$nulls":19},"Vianen"]
[{"$nulls":19},"Voorthuizen"]
[{"$nulls":19},"Vriezenveen Westerhaar"]
[{"$nulls":19},"Waalwijk 1"]
[{"$nulls":19},"Westland  Naaldwijk"]
[{"$nulls":19},"Sint Willebrord"]
[{"$nulls":19},"Woerden"]
[{"$nulls":19},"Wijchen"]
[{"$nulls":19},"Waddinxveen"]
[{"$nulls":19},"Winsum"]
[{"$nulls":19},"Wehl"]
[{"$nulls":19},"Wormerveer"]
[{"$nulls":19},"Winschoten 1"]
[{"$nulls":19},"Warffum Uithuizen"]
[{"$nulls":19},"Westerschouwen"]
[{"$nulls":19},"Wintelre"]
[{"$nulls":19},"Wijnandsrade"]
[{"$nulls":19},"Wierden"]
[{"$nulls":19},"Wagenberg"]
[{"$nulls":19},"Wezep"]
[{"$nulls":19},"Woltersum"]
[{"$nulls":19},"Woudrichem"]
[{"$nulls":19},"Woudenberg"]
[{"$nulls":19},"Winterswijk"]
[{"$nulls":19},"Wouw"]
[{"$nulls":19},"IJsselstein"]
[{"$nulls":19},"IJzendijke"]
[{"$nulls":19},"Yerseke"]
[{"$nulls":19},"Zoetermeer"]
[{"$nulls":19},"Zwijndrecht"]
[{"$nulls":19},"Zundert"]
[{"$nulls":19},"Zutphen"]
[{"$nulls":19},"Zwolle 2"]
[{"$nulls":19},"Zaandam"]
[{"$nulls":19},"Zwartsluis"]
[{"$nulls":19},"Zeewolde"]
[{"$nulls":19},"Zwaagwesteinde"]
[{"$nulls":19},"Haarlemmermeer"]
[{"$nulls":19},"Zuidwolde"]
[{"$nulls":19},"Zaltbommel"]
[{"$nulls":19},"Zevenbergen 1"]
[{"$nulls":19},"Zeeland"]
[{"$nulls":19},"Zwartemeer"]
[{"$nulls":19},"Zevenhuizen"]
{"$rows_empty":63}
["V99",null,"Verspreide leden",{"$f":"LEN(A439)","v":3},{"$f":"LEN(B439)","v":0}]
[{"$nulls":3},{"$f":"LEN(A440)","v":0},{"$f":"LEN(B440)","v":0}]
[{"$nulls":3},0,0]
[{"$nulls":3},0,0]
[{"$nulls":3},0,0]
[{"$nulls":3},0,0]
[{"$nulls":3},0,0]
[{"$nulls":3},0,0]
[{"$nulls":3},0,0]
[{"$nulls":3},0,0]
[{"$nulls":3},0,0]
[{"$nulls":3},0,0]
[{"$nulls":3},0,0]
[{"$nulls":3},0,0]
["▲  ▲  ▲","▲  ▲"]
[null,null," << Betekend dat de code te kort of te lang is"]
[null,null," Kolom A439-A452 (max. 3 karakters in Hoofdletters)"]
["▲  ▲  ▲",null," Kolom B439-B452 (max. 2 karakters in Hoofdletters)"]
[null,null,"<< Betekend dat deze code al in de lijst voorkomt."]

{"sheet":"Inschijfgeld ed","index":4,"n_rows":72,"n_cols":8,"rows_kept":72,"hidden":true,"merged":[[0,0,0,1],[1,0,1,1],[5,0,5,1],[6,0,6,1],[10,0,10,1],[14,0,14,1],[18,0,18,1],[22,0,22,1],[27,0,27,1],[60,0,60,1]]}
["Alleen de gele gemarkeerde vakken aanpassen"]
["Jeugd"]
["Jeugd - Ja","Ja"]
["Jeugd - Nee","Nee"]
[]
["Inschrijfgeld"]
["Enkelingen (EK) / Overjarig Eigenkweek (OEK) / Open Klasse (OK)"]
["senioren",{"v":2,"d":"€ 2.00"}]
["Jeugd",{"v":2,"d":"€ 2.00"}]
[null,"▲ altijd ingevuld houden, wordt er geen inschrijfgeld gevraagd dan € 0,00 invullen"]
["Stammen"]
["senioren",{"v":8,"d":"€ 8.00"}]
["jeugd",{"v":8,"d":"€ 8.00"}]
[null,"▲ altijd ingevuld houden, wordt er geen inschrijfgeld gevraagd dan € 0,00 invullen"]
["Stellen"]
["senioren",{"v":4,"d":"€ 4.00"}]
["jeugd",{"v":4,"d":"€ 4.00"}]
[null,"▲ altijd ingevuld houden, wordt er geen inschrijfgeld gevraagd dan € 0,00 invullen"]
["catalogus/portokosten"]
["senioren",{"v":3.5,"d":"€ 3.50"}]
["jeugd",{"v":3.5,"d":"€ 3.50"}]
[null,"▲ altijd ingevuld houden, wordt er geen catalogus/porto gevraagd dan € 0,00 invullen"]
["Huurkooi"]
["Maak uw keuze op Ja/Nee zetten","Nee"]
["Senioren",{"v":2,"d":"€ 2.00"}]
["Jeugd",{"v":2,"d":"€ 2.00"}]
[null,"▲ altijd ingevuld houden, wordt er geen kooihuur gevraagd dan € 0,00 invullen.           Als er geen huurkooien aangeboden worden zet u \"Maak uw keuze aan/uit zetten\" op \"Nee\" de bedragen achter de \"Senioren\" en \"Jeugd\" kunnen blijven staan."]
["Maximaal inschrijfkosten (exclusief porto-, Cataloguskosten en eventueel kooihuur)"]
["Max.Inschrijfkosten",{"v":999.99,"d":"€ 999.99"}]
[null,"▲ altijd ingevuld houden, geen max.inschrijfgeld dag € 999,99 invullen)"]
["Verenigingsnaam","v.v. 't Sieske"]
["Verenigingsplaats","Stein"]
["Aangesloten bij","AANGESLOTEN BIJ DE NEDERLANDSE BOND VAN VOGELLIEFHEBBERS"]
[]
["Naam TT","Tentoonstelling 2025"]
[]
["Sluiting inschrijfdatum:","23 november 2025"]
[]
["E-mailadres TT Secretaris: ","sieskestein@gmail.com"]
[]
["Inschrijfgeld overmaken naar:","t.n.v. 't Sieske"]
[]
["Op rekeningnummer: ","NL08 RABO 0149243529"]
[]
[]
["Niet wijzigen >>","geldende voorwaarden (zie reglement)"]
["Niet wijzigen >>",{"$f":"B35 & \" \" & B46","v":"Tentoonstelling 2025 geldende voorwaarden (zie reglement)"}]
[]
["Maak uw keuze aan/uit zetten","Uit"]
[null,"▲ aanzetten als u de inzenders zijn/haar soort prijs wilt laten kiezen, anders uit zetten."]
["Maak uw keuze","Bekers"]
[null,"Geld prijzen"]
["Aan","Oorkonde"]
["Uit","Vogelvoer"]
[]
["Maak uw Keuze:"]
[{"$f":"IF(B49=\"Aan\",1,0)","v":0}]
[null,"▲ Als u de inzender laat kiezen welke soort prijs hij/zij.wilt winnen kunt u hierboven"]
[null,"neer zetten uit welke prijzen men kan kiezen.",{"$nulls":5},"  "]
[null,"Als er geen keus gemaakt mag/kan worden moet u de 7 regels leeg maken."]
["Stellen, Stammen, OverJarig Eigenkweek (OEK) en/of Openklasse (OK) gevraagd (Ja / Nee)"]
[]
["Stellen (P)","Ja"]
[]
["Stammen","Ja"]
[]
["Overjarig eigenkweek (OEK)","Ja"]
[]
["Openklasse ","Nee"]
[]
["Ja"]
["Nee"]